http://linkedlifedata.com/resource/umls/id/C0577559
type: T033
type: Concept
has correlation: DISO
has correlation: PHYS
has correlation: CONC
definition: NCI: In medicine, a lump in the body. It may be caused by the abnormal growth of cells, a cyst, hormonal changes, or an immune reaction. A mass may be benign (not cancer) or malignant (cancer).,NCI: A benign or malignant pathologic structure in any part of the body resulting from cystic changes or accumulation of inflammatory or neoplastic cells.,NCI: A benign or malignant pathologic structure in any part of the body, resulting from a neoplastic accumulation of cells, inflammatory cells, or cystic changes.
in scheme: umls
relation: R00738449
relation: R100555200
relation: R100555199
relation: R100555206
relation: R100555207
relation: R100555208
relation: R100555209
relation: R100555210
relation: R100555230
relation: R100555231
relation: R100555233
relation: R100555234
relation: R100555235
relation: R100555236
relation: R100555237
relation: R100555238
relation: R100555239
relation: R100555240
relation: R100555241
relation: R100555242
relation: R100555243
relation: R100555244
relation: R100555245
relation: R100555246
relation: R100555247
relation: R100555248
relation: R100555249
relation: R100555250
relation: R100555251
relation: R100555252
relation: R100555253
relation: R100555254
relation: R100555255
relation: R100555256
relation: R100555257
relation: R100555258
relation: R100555259
relation: R100555260
relation: R100555261
relation: R100555262
relation: R100555263
relation: R100555264
relation: R100555265
relation: R100555266
relation: R100555267
relation: R100555268
relation: R100555269
relation: R100555270
relation: R100555271
relation: R100555272
relation: R100555273
relation: R100555274
relation: R100555275
relation: R100555276
relation: R100555277
relation: R100555278
relation: R100555279
relation: R100555280
relation: R100555281
relation: R100555282
relation: R100555283
relation: R100555284
relation: R100555285
relation: R100555286
relation: R100555287
relation: R100555289
relation: R100555290
relation: R100555291
relation: R100555292
relation: R100555293
relation: R100555294
relation: R100555295
relation: R100555296