http://linkedlifedata.com/resource/umls/id/C0262926
type: T033
type: Concept
has correlation: DISO
has correlation: PHYS
has correlation: PROC
has correlation: OBJC
has correlation: CONC
definition: NCI: A collection of information about a person's health. It may include information about allergies, illnesses and surgeries, and dates and results of physical exams, tests, screenings, and immunizations. It may also include information about medicines taken and about diet and exercise.,NCI: A record of a patient's background regarding health and the occurrence of disease events of the individual. In addition, personal medical history may be a variable in epidemiologic studies.
in scheme: umls
narrower: http://linkedlifedata.com/resource/umls/id/C0679526
narrower: http://linkedlifedata.com/resource/umls/id/C0814462
relation: R04610406
relation: R04610371
relation: R04610372
relation: R04610373
relation: R04610374
relation: R04610375
relation: R04610376
relation: R04610377
relation: R04610378
relation: R04610379
relation: R04610380
relation: R04610393
relation: R04610405
relation: R04610389
relation: R04610381
relation: R04610407
relation: R04610411
relation: R04610384
relation: R04610394
relation: R04610392
relation: R04610387
relation: R04610385
relation: R04610408
relation: R04610401
relation: R04610383
relation: R04610414
relation: R04610409
relation: R04610412
relation: R04610391
relation: R04610390
relation: R04610386
relation: R04610402
relation: R04610403
relation: R04610395
relation: R04610396
relation: R04610382
relation: R04610388
relation: R04610404
relation: R04610397
relation: R04610399
relation: R04610400
relation: R04610398
relation: R04610410
relation: R04610370
relation: R04610413
relation: R04611617
relation: R04611621
relation: R04611620
relation: R04611624
relation: R04611618
relation: R04611619
relation: R04611622
relation: R04611623
relation: R04611616
relation: R04611625
relation: R05213204
relation: R05227177
relation: R00702599
relation: R00720763
relation: R00720764
relation: R00733821
relation: R00743292
relation: R05279916
relation: R05279915
relation: R05279914
relation: R111309848
relation: R111310001
relation: R111309849
relation: R111310003