http://linkedlifedata.com/resource/umls/id/C0041296
type: T047
type: Concept
has correlation: LIVB
has correlation: ANAT
has correlation: DISO
has correlation: GENE
has correlation: PHYS
has correlation: PHEN
has correlation: PROC
has correlation: OBJC
has correlation: DEVI
has correlation: CONC
has correlation: OCCU
has correlation: ORGA
has correlation: CHEM
definition: MSH: Any of the infectious diseases of man and other animals caused by species of MYCOBACTERIUM.,CSP: infectious diseases of man and animals caused by Mycobacterium species and characterized by formation of tubercles and caseous necrosis in the tissues; any organ may be affected but in man the lung is the major seat of the disease and the usual portal through which the infection reaches other organs.,MEDLINEPLUS: Tuberculosis (TB) is a bacterial infection caused by a germ called Mycobacterium tuberculosis. The bacteria usually attack the lungs, but they can also damage other parts of the body. TB spreads through the air when a person with TB of the lungs or throat coughs, sneezes or talks. If you have been exposed, you should go to your doctor for tests. You are more likely to get TB if you have a weak immune system. Symptoms of TB in the lungs may include A bad cough that lasts 3 weeks or longer Weight loss Coughing up blood or mucus Weakness or
in scheme: umls
broader: http://linkedlifedata.com/resource/umls/id/C0035243
broader: http://linkedlifedata.com/resource/umls/id/C0026918
broader: http://linkedlifedata.com/resource/umls/id/C0236104
broader: http://linkedlifedata.com/resource/umls/id/C0001255
broader: http://linkedlifedata.com/resource/umls/id/C0236102
narrower: http://linkedlifedata.com/resource/umls/id/C0041327
narrower: http://linkedlifedata.com/resource/umls/id/C0679362
relation: R28444240
relation: R05300702
relation: R05302373
relation: R05302374
relation: R05302372
relation: R111921109
relation: R111875646
relation: R134151429
relation: R111875648
relation: R111875649
relation: R111875650
relation: R111876051
relation: R111875651
relation: R111875652
relation: R111875653
relation: R111875654
relation: R111875655
relation: R111875948
relation: R134151431
relation: R134151433
relation: R134151435
relation: R134151437
relation: R134151439
relation: R134151441
relation: R111875661
relation: R111875662
relation: R111875663
relation: R111875664
relation: R111875665
relation: R111876002
relation: R111875666
relation: R111875667
relation: R111875668
relation: R111875669
relation: R111875670
relation: R111876004
relation: R111875671
relation: R111875672
relation: R111875673
relation: R111875674
relation: R111875675
relation: R111876000
relation: R111875676
relation: R111875677
relation: R111875678
relation: R111875679
relation: R111875680
relation: R111875978
relation: R111875681
relation: R111875682
relation: R111875683
relation: R111875684
relation: R111875685
relation: R111876041
relation: R111875686
relation: R111875687