http://linkedlifedata.com/resource/umls/id/C0039082
type: T047
type: Concept
has correlation: DISO
has correlation: GENE
has correlation: PHEN
has correlation: CONC
definition: MSH: A characteristic symptom complex.,CSP: heading term for a set of symptoms, usually three or more, which have a complex etiology and characterize a particular pathological state.,NCI: A set of symptoms or conditions that occur together and suggest the presence of a certain disease or an increased chance of developing the disease.,NCI: A group of signs, symptoms, and clinicopathological characteristics that may or may not have a genetic basis and collectively define an abnormal condition.
in scheme: umls
broader: http://linkedlifedata.com/resource/umls/id/C0012634
narrower: http://linkedlifedata.com/resource/umls/id/C0015674
narrower: http://linkedlifedata.com/resource/umls/id/C0001175
narrower: http://linkedlifedata.com/resource/umls/id/C0033046
narrower: http://linkedlifedata.com/resource/umls/id/C0007286
narrower: http://linkedlifedata.com/resource/umls/id/C0013720
narrower: http://linkedlifedata.com/resource/umls/id/C0015923
narrower: http://linkedlifedata.com/resource/umls/id/C0022735
narrower: http://linkedlifedata.com/resource/umls/id/C0035372
narrower: http://linkedlifedata.com/resource/umls/id/C0035400
narrower: http://linkedlifedata.com/resource/umls/id/C0013080
narrower: http://linkedlifedata.com/resource/umls/id/C0038644
narrower: http://linkedlifedata.com/resource/umls/id/C0022104
narrower: http://linkedlifedata.com/resource/umls/id/C0600327
narrower: http://linkedlifedata.com/resource/umls/id/C0004763
narrower: http://linkedlifedata.com/resource/umls/id/C1527336
narrower: http://linkedlifedata.com/resource/umls/id/C0035220
narrower: http://linkedlifedata.com/resource/umls/id/C0035222
narrower: http://linkedlifedata.com/resource/umls/id/C0043202
narrower: http://linkedlifedata.com/resource/umls/id/C0162635
narrower: http://linkedlifedata.com/resource/umls/id/C0032460
narrower: http://linkedlifedata.com/resource/umls/id/C0019937
narrower: http://linkedlifedata.com/resource/umls/id/C0041408
narrower: http://linkedlifedata.com/resource/umls/id/C0004775
narrower: http://linkedlifedata.com/resource/umls/id/C0015624
narrower: http://linkedlifedata.com/resource/umls/id/C0027726
narrower: http://linkedlifedata.com/resource/umls/id/C0022716
narrower: http://linkedlifedata.com/resource/umls/id/C0043459
narrower: http://linkedlifedata.com/resource/umls/id/C0175694
narrower: http://linkedlifedata.com/resource/umls/id/C0175702
narrower: http://linkedlifedata.com/resource/umls/id/C0403529
narrower: http://linkedlifedata.com/resource/umls/id/C0004943
narrower: http://linkedlifedata.com/resource/umls/id/C0039496
narrower: http://linkedlifedata.com/resource/umls/id/C0026691
narrower: http://linkedlifedata.com/resource/umls/id/C0010481
narrower: http://linkedlifedata.com/resource/umls/id/C0043515
narrower: http://linkedlifedata.com/resource/umls/id/C1384514
narrower: http://linkedlifedata.com/resource/umls/id/C0012236
narrower: http://linkedlifedata.com/resource/umls/id/C0795864
narrower: http://linkedlifedata.com/resource/umls/id/C0220704
narrower: http://linkedlifedata.com/resource/umls/id/C0005859
narrower: http://linkedlifedata.com/resource/umls/id/C0007965
narrower: http://linkedlifedata.com/resource/umls/id/C0010314
narrower: http://linkedlifedata.com/resource/umls/id/C0016667
narrower: http://linkedlifedata.com/resource/umls/id/C0019562
narrower: http://linkedlifedata.com/resource/umls/id/C0023374
narrower: http://linkedlifedata.com/resource/umls/id/C0024796
narrower: http://linkedlifedata.com/resource/umls/id/C0028860
narrower: http://linkedlifedata.com/resource/umls/id/C0036992
narrower: http://linkedlifedata.com/resource/umls/id/C0043119
narrower: http://linkedlifedata.com/resource/umls/id/C0043194
narrower: http://linkedlifedata.com/resource/umls/id/C0085278
narrower: http://linkedlifedata.com/resource/umls/id/C0162809
narrower: http://linkedlifedata.com/resource/umls/id/C0524620
narrower: http://linkedlifedata.com/resource/umls/id/C0035012
narrower: http://linkedlifedata.com/resource/umls/id/C0029221
narrower: http://linkedlifedata.com/resource/umls/id/C0265264
narrower: http://linkedlifedata.com/resource/umls/id/C0221030
narrower: http://linkedlifedata.com/resource/umls/id/C1567741
narrower: http://linkedlifedata.com/resource/umls/id/C3266843
narrower: http://linkedlifedata.com/resource/umls/id/C3266898
relation: R28409335
relation: R28518958
relation: R71037567
relation: R05219631
relation: R00693358
relation: R00693359
relation: R00727513
relation: R05243934
relation: R05664358
relation: R05664413
relation: R05664360