http://linkedlifedata.com/resource/umls/id/C0032343
type: T037
type: Concept
has correlation: LIVB
has correlation: ANAT
has correlation: DISO
has correlation: PHYS
has correlation: PHEN
has correlation: ACTI
has correlation: PROC
has correlation: OBJC
has correlation: CONC
has correlation: OCCU
has correlation: ORGA
has correlation: CHEM
definition: MSH: A condition or physical state produced by the ingestion, injection, inhalation of or exposure to a deleterious agent.,CSP: condition or physical state produced by the ingestion, injection or inhalation of, or exposure to a deleterious agent.,MEDLINEPLUS: A poison is any substance that is harmful to your body. You might swallow it, inhale it, inject it or absorb it through your skin. Poisons can include Prescription or over-the-counter medicines taken in doses that are too high Overdoses of illegal drugs Carbon monoxide from gas appliances Household products, such as laundry powder or furniture polish Pesticides Indoor or outdoor plants Metals such as lead
in scheme: umls
narrower: http://linkedlifedata.com/resource/umls/id/C0032087
narrower: http://linkedlifedata.com/resource/umls/id/C0017107
narrower: http://linkedlifedata.com/resource/umls/id/C0392622
narrower: http://linkedlifedata.com/resource/umls/id/C0016479
narrower: http://linkedlifedata.com/resource/umls/id/C0274869
narrower: http://linkedlifedata.com/resource/umls/id/C0596648
narrower: http://linkedlifedata.com/resource/umls/id/C0392621
relation: R05299577
relation: R05299579
relation: R05299578
relation: R05300694
relation: R05302325
relation: R05302324
relation: R05302326
relation: R05302328
relation: R05302329
relation: R05302334
relation: R05302327
relation: R44102445
relation: R05302332
relation: R44102444
relation: R05302330
relation: R28512396
relation: R64592533
relation: R120416314
relation: R120416315
relation: R120416316
relation: R120416318
relation: R120416320
relation: R120416321
relation: R120416322
relation: R120416323
relation: R120416324
relation: R120416334
relation: R120416325
relation: R120416326
relation: R120416327
relation: R120416328
relation: R120416330
relation: R120416331
relation: R120416332
relation: R120416333
relation: R120416337
relation: R120416338
relation: R120416340
relation: R120416341
relation: R120416342
relation: R120416343
relation: R120416344
relation: R120416345
relation: R120416346
relation: R120416347
relation: R120416348
relation: R120416349
relation: R120416336
relation: R120416317
relation: R120416329
relation: R120416339
relation: R120416319
relation: R120416335
relation: R71132927
relation: R71224145
relation: R71179798
relation: R71300633