http://linkedlifedata.com/resource/umls/id/C0032285
type: T047
type: Concept
has correlation: LIVB
has correlation: ANAT
has correlation: DISO
has correlation: PHYS
has correlation: PHEN
has correlation: PROC
has correlation: CONC
has correlation: OCCU
has correlation: CHEM
definition: MSH: Inflammation of any part, segment or lobe, of the lung parenchyma.,CSP: inflammation of the lungs with consolidation and exudation.,MEDLINEPLUS: Pneumonia is an inflammation of the lung, usually caused by an infection. Three common causes are bacteria, viruses and fungi. You can also get pneumonia by accidentally inhaling a liquid or chemical. People most at risk are older than 65 or younger than 2 years of age, or already have health problems. If you have pneumonia, you may have difficulty breathing and have a cough and a fever. A physical exam and history can help determine if you have pneumonia. Chest x-rays and blood tests can help determine what is wrong. Treatment depends on what made you sick. If bacteria are the cause, antibiotics should help. Viral pneumonia may get better with rest and drinking liquids. Preventing pneumonia is always better than treating it. The best preventive measures include washing your hands frequently, not smoking, and wearing a mask when cleaning dusty or
in scheme: umls
broader: http://linkedlifedata.com/resource/umls/id/C0035243
broader: http://linkedlifedata.com/resource/umls/id/C0024115
broader: http://linkedlifedata.com/resource/umls/id/C0035204
broader: http://linkedlifedata.com/resource/umls/id/C0236104
broader: http://linkedlifedata.com/resource/umls/id/C0679406
narrower: http://linkedlifedata.com/resource/umls/id/C0032310
narrower: http://linkedlifedata.com/resource/umls/id/C0032305
narrower: http://linkedlifedata.com/resource/umls/id/C0004626
narrower: http://linkedlifedata.com/resource/umls/id/C0549472
narrower: http://linkedlifedata.com/resource/umls/id/C0032300
relation: R28482321
relation: R06493975
relation: R06493976
relation: R28512365
relation: R100026130
relation: R32173283
relation: R120415529
relation: R120415530
relation: R120415531
relation: R120415532
relation: R120415534
relation: R120415536
relation: R120415537
relation: R120415538
relation: R120415539
relation: R120415540
relation: R120415550
relation: R120415541
relation: R120415542
relation: R120415543
relation: R120415544
relation: R120415546
relation: R120415547
relation: R120415548
relation: R120415549
relation: R120415553
relation: R120415554
relation: R120415556
relation: R120415557
relation: R120415558
relation: R120415559
relation: R120415560
relation: R120415561
relation: R120415562
relation: R120415563
relation: R120415564
relation: R120415565
relation: R120415552
relation: R120415533
relation: R120415545
relation: R120415555
relation: R120415535
relation: R120415551
relation: R71175360
relation: R71303442
relation: R71183056
relation: R71179111
relation: R71398207
relation: R71291225
relation: R71231929
relation: R70997178
relation: R71386971
relation: R128909253
relation: R101252248
relation: R71131790
relation: R71354364
relation: R71244638