http://linkedlifedata.com/resource/umls/id/C0030956
type: T116
type: Concept
has correlation: ANAT
has correlation: GENE
has correlation: PHYS
has correlation: PHEN
has correlation: PROC
has correlation: CONC
has correlation: CHEM
definition: MSH: Members of the class of compounds composed of AMINO ACIDS joined together by peptide bonds between adjacent amino acids into linear, branched or cyclical structures. OLIGOPEPTIDES are composed of approximately 2-12 amino acids. Polypeptides are composed of approximately 13 or more amino acids. PROTEINS are linear polypeptides that are normally synthesized on RIBOSOMES.,CSP: chemical bond with the structure -CO-CHR-NH-; in biochemistry, polymers of alpha-aminoacids joined by peptide bonds.,CHV: a kind of chemical compound,CHV: a kind of chemical compound,NCI: A compound of two or more amino acids where the alpha carboxyl group of one is bound to the alpha amino group of another. Peptides are smaller than proteins and the dividing line is around 50 amino acids.
in scheme: umls
broader: http://linkedlifedata.com/resource/umls/id/C0002526
narrower: http://linkedlifedata.com/resource/umls/id/C0669253
narrower: http://linkedlifedata.com/resource/umls/id/C0289863
narrower: http://linkedlifedata.com/resource/umls/id/C0065906
narrower: http://linkedlifedata.com/resource/umls/id/C0033684
narrower: http://linkedlifedata.com/resource/umls/id/C0006558
narrower: http://linkedlifedata.com/resource/umls/id/C0012512
narrower: http://linkedlifedata.com/resource/umls/id/C0016026
narrower: http://linkedlifedata.com/resource/umls/id/C0017817
narrower: http://linkedlifedata.com/resource/umls/id/C0017953
narrower: http://linkedlifedata.com/resource/umls/id/C0027481
narrower: http://linkedlifedata.com/resource/umls/id/C0027597
narrower: http://linkedlifedata.com/resource/umls/id/C0027783
narrower: http://linkedlifedata.com/resource/umls/id/C0027895
narrower: http://linkedlifedata.com/resource/umls/id/C0028954
narrower: http://linkedlifedata.com/resource/umls/id/C0030934
narrower: http://linkedlifedata.com/resource/umls/id/C0030935
narrower: http://linkedlifedata.com/resource/umls/id/C0030943
narrower: http://linkedlifedata.com/resource/umls/id/C0030954
narrower: http://linkedlifedata.com/resource/umls/id/C0030957
narrower: http://linkedlifedata.com/resource/umls/id/C0031684
narrower: http://linkedlifedata.com/resource/umls/id/C0032500
narrower: http://linkedlifedata.com/resource/umls/id/C0253563
narrower: http://linkedlifedata.com/resource/umls/id/C0167117
narrower: http://linkedlifedata.com/resource/umls/id/C0289884
narrower: http://linkedlifedata.com/resource/umls/id/C0673028
narrower: http://linkedlifedata.com/resource/umls/id/C0032200
narrower: http://linkedlifedata.com/resource/umls/id/C0389585
narrower: http://linkedlifedata.com/resource/umls/id/C0914689
narrower: http://linkedlifedata.com/resource/umls/id/C0258069
narrower: http://linkedlifedata.com/resource/umls/id/C0146550
narrower: http://linkedlifedata.com/resource/umls/id/C0660409
narrower: http://linkedlifedata.com/resource/umls/id/C1099999
narrower: http://linkedlifedata.com/resource/umls/id/C0208872
narrower: http://linkedlifedata.com/resource/umls/id/C1305923
narrower: http://linkedlifedata.com/resource/umls/id/C1530889
narrower: http://linkedlifedata.com/resource/umls/id/C1722685
narrower: http://linkedlifedata.com/resource/umls/id/C1742794
narrower: http://linkedlifedata.com/resource/umls/id/C2000261
narrower: http://linkedlifedata.com/resource/umls/id/C2827125
narrower: http://linkedlifedata.com/resource/umls/id/C0312439
narrower: http://linkedlifedata.com/resource/umls/id/C0389204
narrower: http://linkedlifedata.com/resource/umls/id/C0243906
narrower: http://linkedlifedata.com/resource/umls/id/C0763438
narrower: http://linkedlifedata.com/resource/umls/id/C0218664
narrower: http://linkedlifedata.com/resource/umls/id/C1439081
narrower: http://linkedlifedata.com/resource/umls/id/C1447027
narrower: http://linkedlifedata.com/resource/umls/id/C1448479
narrower: http://linkedlifedata.com/resource/umls/id/C1565061
narrower: http://linkedlifedata.com/resource/umls/id/C1565062
narrower: http://linkedlifedata.com/resource/umls/id/C1743071
narrower: http://linkedlifedata.com/resource/umls/id/C0050326
narrower: http://linkedlifedata.com/resource/umls/id/C0058815
narrower: http://linkedlifedata.com/resource/umls/id/C0059433
narrower: http://linkedlifedata.com/resource/umls/id/C0061002
narrower: http://linkedlifedata.com/resource/umls/id/C0061122
narrower: http://linkedlifedata.com/resource/umls/id/C0066512
narrower: http://linkedlifedata.com/resource/umls/id/C0127611
narrower: http://linkedlifedata.com/resource/umls/id/C0250273
narrower: http://linkedlifedata.com/resource/umls/id/C0258871
narrower: http://linkedlifedata.com/resource/umls/id/C0285652
narrower: http://linkedlifedata.com/resource/umls/id/C0294726
narrower: http://linkedlifedata.com/resource/umls/id/C0675581
narrower: http://linkedlifedata.com/resource/umls/id/C0768627
narrower: http://linkedlifedata.com/resource/umls/id/C1099876
narrower: http://linkedlifedata.com/resource/umls/id/C1430097
narrower: http://linkedlifedata.com/resource/umls/id/C1430418
narrower: http://linkedlifedata.com/resource/umls/id/C1431161
narrower: http://linkedlifedata.com/resource/umls/id/C1568811