http://linkedlifedata.com/resource/umls/id/C0030567
type: T047
type: Concept
has correlation: LIVB
has correlation: ANAT
has correlation: DISO
has correlation: GENE
has correlation: PHYS
has correlation: PHEN
has correlation: ACTI
has correlation: PROC
has correlation: OBJC
has correlation: DEVI
has correlation: CONC
has correlation: OCCU
has correlation: ORGA
has correlation: CHEM
definition: MSH: A progressive, degenerative neurologic disease characterized by a TREMOR that is maximal at rest, retropulsion (i.e. a tendency to fall backwards), rigidity, stooped posture, slowness of voluntary movements, and a masklike facial expression. Pathologic features include loss of melanin containing neurons in the substantia nigra and other pigmented nuclei of the brainstem. LEWY BODIES are present in the substantia nigra and locus coeruleus but may also be found in a related condition (LEWY BODY DISEASE, DIFFUSE) characterized by dementia in combination with varying degrees of parkinsonism. (Adams et al., Principles of Neurology, 6th ed, p1059, pp1067-75),CSP: progressive, degenerative disorder of the nervous system characterized by tremors, rigidity, bradykinesia, postural instability, and gait abnormalities; caused by a loss of neurons and a decrease of dopamine in the basal ganglia.,NCI: A progressive disorder of the nervous system marked by muscle tremors, muscle rigidity, decreased mobility, stooped po
in scheme: umls
broader: http://linkedlifedata.com/resource/umls/id/C0015371
broader: http://linkedlifedata.com/resource/umls/id/C0027765
broader: http://linkedlifedata.com/resource/umls/id/C0270715
broader: http://linkedlifedata.com/resource/umls/id/C0029221
narrower: http://linkedlifedata.com/resource/umls/id/C0796195
narrower: http://linkedlifedata.com/resource/umls/id/C1853445
narrower: http://linkedlifedata.com/resource/umls/id/C1853833
narrower: http://linkedlifedata.com/resource/umls/id/C1868675
narrower: http://linkedlifedata.com/resource/umls/id/C2751067
narrower: http://linkedlifedata.com/resource/umls/id/C1854182
narrower: http://linkedlifedata.com/resource/umls/id/C2931436
narrower: http://linkedlifedata.com/resource/umls/id/C1850076
narrower: http://linkedlifedata.com/resource/umls/id/C1865581
narrower: http://linkedlifedata.com/resource/umls/id/C3489791
relation: R64558413
relation: R120400065
relation: R120400066
relation: R120400067
relation: R120400069
relation: R120400071
relation: R120400072
relation: R120400073
relation: R120400074
relation: R120400075
relation: R120400085
relation: R120400076
relation: R120400077
relation: R120400078
relation: R120400079
relation: R120400081
relation: R120400082
relation: R120400083
relation: R120400084
relation: R120400088
relation: R120400089
relation: R120400091
relation: R120400092
relation: R120400093
relation: R120400094
relation: R120400095
relation: R120400096
relation: R120400097
relation: R120400098
relation: R120400099
relation: R120400100
relation: R120400087
relation: R120400068
relation: R120400080
relation: R120400090
relation: R120400070
relation: R120400086
relation: R71145151
relation: R71275438
relation: R128891052
relation: R134637302
relation: R134637303
relation: R134637304
relation: R134637305
relation: R134637306
relation: R128891051
relation: R134637308
relation: R128891050