http://linkedlifedata.com/resource/umls/id/C0030054
type: T121
type: T196
type: Concept
has correlation: ANAT
has correlation: DISO
has correlation: PHYS
has correlation: PROC
has correlation: DEVI
has correlation: CONC
has correlation: CHEM
definition: MSH: An element with atomic symbol O, atomic number 8, and atomic weight [15.99903; 15.99977]. It is the most abundant element on earth and essential for respiration.,CSP: use this term only for elemental or gaseous oxygen (02); for other compounds see OXYGEN COMPOUND.,NCI: A colorless, odorless gas. It is needed for animal and plant life. Oxygen that is breathed in enters the blood from the lungs and travels to the tissues.,NCI: An element with atomic symbol O, atomic number 8, and atomic weight 16.
in scheme: umls
broader: http://linkedlifedata.com/resource/umls/id/C0013879
broader: http://linkedlifedata.com/resource/umls/id/C0682905
narrower: http://linkedlifedata.com/resource/umls/id/C0162772
narrower: http://linkedlifedata.com/resource/umls/id/C0054692
narrower: http://linkedlifedata.com/resource/umls/id/C0059395
narrower: http://linkedlifedata.com/resource/umls/id/C0062185
narrower: http://linkedlifedata.com/resource/umls/id/C1587911
narrower: http://linkedlifedata.com/resource/umls/id/C1587914
narrower: http://linkedlifedata.com/resource/umls/id/C1587921
narrower: http://linkedlifedata.com/resource/umls/id/C1587924
narrower: http://linkedlifedata.com/resource/umls/id/C1587927
narrower: http://linkedlifedata.com/resource/umls/id/C1587930
narrower: http://linkedlifedata.com/resource/umls/id/C2920828
relation: R112186395
relation: R32173130
relation: R120395299
relation: R120395300
relation: R120395303
relation: R120395304
relation: R120395305
relation: R120395306
relation: R120395307
relation: R120395308
relation: R120395310
relation: R120395311
relation: R120395312
relation: R120395314
relation: R120395315
relation: R120395316
relation: R120395317
relation: R120395318
relation: R120395319
relation: R120395320
relation: R120395321
relation: R120395322
relation: R120395323
relation: R120395324
relation: R120395309
relation: R120395301
relation: R120395313
relation: R71351516
relation: R71374651
relation: R71164057
relation: R128890096
relation: R128890095
relation: R128890098
relation: R128890099
relation: R128890100
relation: R128890101
relation: R128890097
relation: R128890102
relation: R28389499
relation: R28389500
relation: R28389501
relation: R28389502
relation: R71067612
relation: R71342469
relation: R71122000
relation: R71176974
relation: R71177069
relation: R71342660
relation: R71012412
relation: R71232382
relation: R71122136
relation: R70997940
relation: R70997941
relation: R71162380
relation: R71370509