http://linkedlifedata.com/resource/umls/id/C0028351
type: T109
type: T121
type: T124
type: Concept
has correlation: ANAT
has correlation: DISO
has correlation: PHYS
has correlation: PHEN
has correlation: PROC
has correlation: CONC
has correlation: CHEM
definition: MSH: Precursor of epinephrine that is secreted by the adrenal medulla and is a widespread central and autonomic neurotransmitter. Norepinephrine is the principal transmitter of most postganglionic sympathetic fibers and of the diffuse projection system in the brain arising from the locus ceruleus. It is also found in plants and is used pharmacologically as a sympathomimetic.,CSP: precursor of epinephrine; widespread central and autonomic neurotransmitter, principal transmitter of most postganglionic sympathetic fibers; secreted by the adrenal medulla; used pharmacologically as a sympathomimetic.,NCI: A synthetic phenylethylamine that mimics the sympathomimetic actions of the endogenous norepinephrine. Norepinephrine acts directly on the alpha- and beta-adrenergic receptors. Clinically, norepinephrine is used as a peripheral vasoconstrictor that causes constriction of arterial and venous beds via its alpha-adrenergic action. It is also used as a potent inotropic and chronotropic stimulator of the heart mediate
in scheme: umls
broader: http://linkedlifedata.com/resource/umls/id/C0001637
broader: http://linkedlifedata.com/resource/umls/id/C0014563
broader: http://linkedlifedata.com/resource/umls/id/C0007209
broader: http://linkedlifedata.com/resource/umls/id/C0007412
broader: http://linkedlifedata.com/resource/umls/id/C0042397
broader: http://linkedlifedata.com/resource/umls/id/C0039052
broader: http://linkedlifedata.com/resource/umls/id/C0027908
broader: http://linkedlifedata.com/resource/umls/id/C0001640
broader: http://linkedlifedata.com/resource/umls/id/C0001644
broader: http://linkedlifedata.com/resource/umls/id/C0005497
broader: http://linkedlifedata.com/resource/umls/id/C0949371
broader: http://linkedlifedata.com/resource/umls/id/C0301822
narrower: http://linkedlifedata.com/resource/umls/id/C0028333
narrower: http://linkedlifedata.com/resource/umls/id/C0163026
narrower: http://linkedlifedata.com/resource/umls/id/C0602107
narrower: http://linkedlifedata.com/resource/umls/id/C2745581
narrower: http://linkedlifedata.com/resource/umls/id/C0205844
narrower: http://linkedlifedata.com/resource/umls/id/C0733815
narrower: http://linkedlifedata.com/resource/umls/id/C0047388
narrower: http://linkedlifedata.com/resource/umls/id/C0048390
narrower: http://linkedlifedata.com/resource/umls/id/C0049574
narrower: http://linkedlifedata.com/resource/umls/id/C0054104
narrower: http://linkedlifedata.com/resource/umls/id/C0067903
narrower: http://linkedlifedata.com/resource/umls/id/C0068954
narrower: http://linkedlifedata.com/resource/umls/id/C0068955
narrower: http://linkedlifedata.com/resource/umls/id/C0068956
narrower: http://linkedlifedata.com/resource/umls/id/C0069019
narrower: http://linkedlifedata.com/resource/umls/id/C0082318
narrower: http://linkedlifedata.com/resource/umls/id/C0083784
narrower: http://linkedlifedata.com/resource/umls/id/C0205860
narrower: http://linkedlifedata.com/resource/umls/id/C0391140
narrower: http://linkedlifedata.com/resource/umls/id/C0601540
narrower: http://linkedlifedata.com/resource/umls/id/C0626153
narrower: http://linkedlifedata.com/resource/umls/id/C0627307
narrower: http://linkedlifedata.com/resource/umls/id/C0627310
narrower: http://linkedlifedata.com/resource/umls/id/C0635022
narrower: http://linkedlifedata.com/resource/umls/id/C0638188
narrower: http://linkedlifedata.com/resource/umls/id/C0655993
narrower: http://linkedlifedata.com/resource/umls/id/C0702008
narrower: http://linkedlifedata.com/resource/umls/id/C0772489
narrower: http://linkedlifedata.com/resource/umls/id/C0887096
narrower: http://linkedlifedata.com/resource/umls/id/C0887097
narrower: http://linkedlifedata.com/resource/umls/id/C0887098
narrower: http://linkedlifedata.com/resource/umls/id/C0887099
narrower: http://linkedlifedata.com/resource/umls/id/C0887100
narrower: http://linkedlifedata.com/resource/umls/id/C0887101
narrower: http://linkedlifedata.com/resource/umls/id/C0887102
narrower: http://linkedlifedata.com/resource/umls/id/C0887103
narrower: http://linkedlifedata.com/resource/umls/id/C0917760
narrower: http://linkedlifedata.com/resource/umls/id/C0917761
narrower: http://linkedlifedata.com/resource/umls/id/C0960872
narrower: http://linkedlifedata.com/resource/umls/id/C1173760
narrower: http://linkedlifedata.com/resource/umls/id/C1173761
narrower: http://linkedlifedata.com/resource/umls/id/C1432800
narrower: http://linkedlifedata.com/resource/umls/id/C1436729
narrower: http://linkedlifedata.com/resource/umls/id/C1450037
relation: R112185848
relation: R112185856
relation: R112186290
relation: R112186297
relation: R32104854
relation: R32104846
relation: R32104859
relation: R32104860
relation: R32104850
relation: R32104847
relation: R32104849