http://linkedlifedata.com/resource/umls/id/C0026764
type: T191
type: Concept
has correlation: LIVB
has correlation: ANAT
has correlation: DISO
has correlation: GENE
has correlation: PHEN
has correlation: PROC
has correlation: OBJC
has correlation: CONC
has correlation: OCCU
has correlation: ORGA
has correlation: CHEM
definition: MSH: A malignancy of mature PLASMA CELLS engaging in monoclonal immunoglobulin production. It is characterized by hyperglobulinemia, excess Bence-Jones proteins (free monoclonal IMMUNOGLOBULIN LIGHT CHAINS) in the urine, skeletal destruction, bone pain, and fractures. Other features include ANEMIA; HYPERCALCEMIA; and RENAL INSUFFICIENCY.,CSP: malignant neoplasm of plasma cells usually arising in the bone marrow and manifested by skeletal destruction, bone pain, and the presence of anomalous immunoglobulins.,MEDLINEPLUS: Multiple myeloma is a cancer that begins in plasma cells, a type of white blood cell. These cells are part of your immune system, which helps protect the body from germs and other harmful substances. In time, myeloma cells collect in the bone marrow and in the solid parts of bone. No one knows the exact causes of multiple myeloma, but it is more common in older people and African-Americans. Early symptoms may include Bone pain, often in the back or ribs Broken bones</
in scheme: umls
broader: http://linkedlifedata.com/resource/umls/id/C0027651
broader: http://linkedlifedata.com/resource/umls/id/C0178516
relation: R28507459
relation: R28507461
relation: R120373239
relation: R120373240
relation: R120373241
relation: R120373242
relation: R120373243
relation: R120373245
relation: R120373247
relation: R120373248
relation: R120373249
relation: R120373250
relation: R120373251
relation: R120373261
relation: R120373252
relation: R120373253
relation: R120373254
relation: R120373255
relation: R120373257
relation: R120373258
relation: R120373259
relation: R120373260
relation: R120373264
relation: R120373265
relation: R120373267
relation: R120373268
relation: R120373269
relation: R120373270
relation: R120373272
relation: R120373273
relation: R120373274
relation: R120373275
relation: R120373276
relation: R120373277
relation: R120373279
relation: R120373278
relation: R120373280
relation: R120373263
relation: R120373244
relation: R120373256
relation: R120373271
relation: R120373266
relation: R120373246
relation: R120373262
relation: R71234231
relation: R71212731
relation: R71251415
relation: R70986324
relation: R71101608
relation: R28389001
relation: R101252064
relation: R123295775
relation: R71286230
relation: R71011488
relation: R71290636
relation: R71286231
relation: R71286660
relation: R71180019
relation: R71070088
relation: R71290690
relation: R71070133
relation: R71070134
relation: R71125149