http://linkedlifedata.com/resource/umls/id/C0026549
type: T109
type: T121
type: Concept
has correlation: LIVB
has correlation: ANAT
has correlation: DISO
has correlation: PHYS
has correlation: PHEN
has correlation: PROC
has correlation: CONC
has correlation: CHEM
definition: MSH: The principal alkaloid in opium and the prototype opiate analgesic and narcotic. Morphine has widespread effects in the central nervous system and on smooth muscle.,CSP: principal and most active narcotic alkaloid of opium, having powerful analgesic action and some central stimulant action; abuse leads to dependence.,NCI: An opiate alkaloid isolated from the plant Papaver somniferum and produced synthetically. Morphine binds to and activates specific opiate receptors (delta, mu and kappa), each of which are involved in controlling different brain functions. In the central nervous and gastrointestinal systems, this agent exhibits widespread effects including analgesia, anxiolysis, euphoria, sedation, respiratory depression, and gastrointestinal system smooth muscle contraction. (NCI04),CHV: a kind of narcotic pain relieving drug
in scheme: umls
broader: http://linkedlifedata.com/resource/umls/id/C0678500
broader: http://linkedlifedata.com/resource/umls/id/C0002772
broader: http://linkedlifedata.com/resource/umls/id/C0026548
broader: http://linkedlifedata.com/resource/umls/id/C0027415
broader: http://linkedlifedata.com/resource/umls/id/C0027409
broader: http://linkedlifedata.com/resource/umls/id/C0678504
broader: http://linkedlifedata.com/resource/umls/id/C0682984
broader: http://linkedlifedata.com/resource/umls/id/C0697274
narrower: http://linkedlifedata.com/resource/umls/id/C0066814
narrower: http://linkedlifedata.com/resource/umls/id/C0009214
narrower: http://linkedlifedata.com/resource/umls/id/C0011892
narrower: http://linkedlifedata.com/resource/umls/id/C0003596
narrower: http://linkedlifedata.com/resource/umls/id/C0027355
narrower: http://linkedlifedata.com/resource/umls/id/C0027358
narrower: http://linkedlifedata.com/resource/umls/id/C2723235
narrower: http://linkedlifedata.com/resource/umls/id/C0770901
narrower: http://linkedlifedata.com/resource/umls/id/C1874397
narrower: http://linkedlifedata.com/resource/umls/id/C0911316
narrower: http://linkedlifedata.com/resource/umls/id/C0054139
narrower: http://linkedlifedata.com/resource/umls/id/C0621633
narrower: http://linkedlifedata.com/resource/umls/id/C0640784
narrower: http://linkedlifedata.com/resource/umls/id/C0074947
narrower: http://linkedlifedata.com/resource/umls/id/C0730975
narrower: http://linkedlifedata.com/resource/umls/id/C0730976
narrower: http://linkedlifedata.com/resource/umls/id/C1172180
narrower: http://linkedlifedata.com/resource/umls/id/C0055407
narrower: http://linkedlifedata.com/resource/umls/id/C0212066
narrower: http://linkedlifedata.com/resource/umls/id/C0026551
narrower: http://linkedlifedata.com/resource/umls/id/C0068547
narrower: http://linkedlifedata.com/resource/umls/id/C0385247
narrower: http://linkedlifedata.com/resource/umls/id/C0591748
narrower: http://linkedlifedata.com/resource/umls/id/C0591917
narrower: http://linkedlifedata.com/resource/umls/id/C0592110
narrower: http://linkedlifedata.com/resource/umls/id/C0592864
narrower: http://linkedlifedata.com/resource/umls/id/C0593461
narrower: http://linkedlifedata.com/resource/umls/id/C0595293
narrower: http://linkedlifedata.com/resource/umls/id/C0700655
narrower: http://linkedlifedata.com/resource/umls/id/C0700703
narrower: http://linkedlifedata.com/resource/umls/id/C0700785
narrower: http://linkedlifedata.com/resource/umls/id/C0700786
narrower: http://linkedlifedata.com/resource/umls/id/C0700787
narrower: http://linkedlifedata.com/resource/umls/id/C0700788
narrower: http://linkedlifedata.com/resource/umls/id/C0700789
narrower: http://linkedlifedata.com/resource/umls/id/C0700790
narrower: http://linkedlifedata.com/resource/umls/id/C0722978
narrower: http://linkedlifedata.com/resource/umls/id/C0723035
narrower: http://linkedlifedata.com/resource/umls/id/C0731176
narrower: http://linkedlifedata.com/resource/umls/id/C0770945
narrower: http://linkedlifedata.com/resource/umls/id/C0949361
narrower: http://linkedlifedata.com/resource/umls/id/C0949362
narrower: http://linkedlifedata.com/resource/umls/id/C1170078
narrower: http://linkedlifedata.com/resource/umls/id/C1171499
narrower: http://linkedlifedata.com/resource/umls/id/C1529724
narrower: http://linkedlifedata.com/resource/umls/id/C2719312
narrower: http://linkedlifedata.com/resource/umls/id/C2726988
relation: R112186168
relation: R112186169
relation: R32104229
relation: R32104230
relation: R32104233
relation: R32104234
relation: R32104235
relation: R32104236
relation: R32104232
relation: R32104231
relation: R120371610
relation: R120371611