http://linkedlifedata.com/resource/umls/id/C0025202
type: T191
type: Concept
has correlation: LIVB
has correlation: ANAT
has correlation: DISO
has correlation: GENE
has correlation: PHYS
has correlation: PHEN
has correlation: PROC
has correlation: OBJC
has correlation: DEVI
has correlation: CONC
has correlation: OCCU
has correlation: ORGA
has correlation: CHEM
definition: MSH: A malignant neoplasm derived from cells that are capable of forming melanin, which may occur in the skin of any part of the body, in the eye, or, rarely, in the mucous membranes of the genitalia, anus, oral cavity, or other sites. It occurs mostly in adults and may originate de novo or from a pigmented nevus or malignant lentigo. Melanomas frequently metastasize widely, and the regional lymph nodes, liver, lungs, and brain are likely to be involved. The incidence of malignant skin melanomas is rising rapidly in all parts of the world. (Stedman, 25th ed; from Rook et al., Textbook of Dermatology, 4th ed, p2445),CSP: malignant neoplasm derived from cells that are capable of forming melanin, which may occur in the skin of any part of the body, in the eye, or, rarely, in the mucous membranes of the genitalia, anus, oral cavity, or other sites; occurring mostly in adults and may originate de novo or from a pigmented nevus or malignant lentigo; frequently metastasize widely, and the regional lymph nodes, liver
in scheme: umls
broader: http://linkedlifedata.com/resource/umls/id/C0027651
broader: http://linkedlifedata.com/resource/umls/id/C0007114
broader: http://linkedlifedata.com/resource/umls/id/C0037286
narrower: http://linkedlifedata.com/resource/umls/id/C0220633
narrower: http://linkedlifedata.com/resource/umls/id/C1835042
narrower: http://linkedlifedata.com/resource/umls/id/C2931191
relation: R28482301
relation: R28482302
relation: R28482303
relation: R28506139
relation: R120361654
relation: R120361655
relation: R120361656
relation: R120361657
relation: R120361658
relation: R120361660
relation: R120361662
relation: R120361663
relation: R120361664
relation: R120361665
relation: R120361666
relation: R120361676
relation: R120361667
relation: R120361668
relation: R120361669
relation: R120361670
relation: R120361672
relation: R120361673
relation: R120361674
relation: R120361675
relation: R120361679
relation: R120361680
relation: R120361682
relation: R120361683
relation: R120361684
relation: R120361685
relation: R120361687
relation: R120361688
relation: R120361689
relation: R120361690
relation: R120361691
relation: R120361692
relation: R120361694
relation: R120361693
relation: R120361695
relation: R120361678
relation: R120361659
relation: R120361671
relation: R120361686
relation: R120361681
relation: R120361661
relation: R120361677
relation: R71222576
relation: R71291723
relation: R71247074
relation: R71041177
relation: R71097613
relation: R128859144
relation: R128859142
relation: R128859143
relation: R101252026
relation: R101252024
relation: R101252025