http://linkedlifedata.com/resource/umls/id/C0024299
type: T191
type: Concept
has correlation: LIVB
has correlation: ANAT
has correlation: DISO
has correlation: GENE
has correlation: PHYS
has correlation: PHEN
has correlation: PROC
has correlation: OBJC
has correlation: CONC
has correlation: OCCU
has correlation: ORGA
has correlation: CHEM
definition: MSH: A general term for various neoplastic diseases of the lymphoid tissue.,CSP: malignant (clonal) proliferation of B- or T- lymphocytes which involves the lymph nodes, bone marrow and/or extranodal sites; general term for various neoplastic diseases of the lymphoid tissue.,NCI: Cancer that begins in cells of the immune system. There are two basic categories of lymphomas. One kind is Hodgkin lymphoma, which is marked by the presence of a type of cell called the Reed-Sternberg cell. The other category is non-Hodgkin lymphomas, which includes a large, diverse group of cancers of immune system cells. Non-Hodgkin lymphomas can be further divided into cancers that have an indolent (slow-growing) course and those that have an aggressive (fast-growing) course. These subtypes behave and respond to treatment differently. Both Hodgkin and non-Hodgkin lymphomas can occur in children and adults, and prognosis and treatment depend on the stage and the type of cancer.,MEDLINEPLUS: Lymphoma is a cancer of a part of the
in scheme: umls
broader: http://linkedlifedata.com/resource/umls/id/C0027651
broader: http://linkedlifedata.com/resource/umls/id/C0178516
narrower: http://linkedlifedata.com/resource/umls/id/C0024793
narrower: http://linkedlifedata.com/resource/umls/id/C0019829
narrower: http://linkedlifedata.com/resource/umls/id/C0024305
narrower: http://linkedlifedata.com/resource/umls/id/C0026948
narrower: http://linkedlifedata.com/resource/umls/id/C0271333
narrower: http://linkedlifedata.com/resource/umls/id/C0040116
narrower: http://linkedlifedata.com/resource/umls/id/C0596869
narrower: http://linkedlifedata.com/resource/umls/id/C0024302
narrower: http://linkedlifedata.com/resource/umls/id/C0079734
relation: R28409320
relation: R28424095
relation: R28498051
relation: R28424096
relation: R28505179
relation: R120355254
relation: R120355255
relation: R120355256
relation: R120355257
relation: R120355259
relation: R120355261
relation: R120355262
relation: R120355263
relation: R120355264
relation: R120355265
relation: R120355275
relation: R120355266
relation: R120355267
relation: R120355268
relation: R120355269
relation: R120355271
relation: R120355272
relation: R120355273
relation: R120355274
relation: R120355278
relation: R120355279
relation: R120355281
relation: R120355282
relation: R120355283
relation: R120355284
relation: R120355285
relation: R120355286
relation: R120355287
relation: R120355288
relation: R120355289
relation: R120355291
relation: R120355290
relation: R120355292
relation: R120355277
relation: R120355258
relation: R120355270
relation: R120355280
relation: R120355260
relation: R120355276
relation: R71291403
relation: R71334203
relation: R71123377
relation: R119526409
relation: R71099906
relation: R71199443
relation: R128857557
relation: R128857558
relation: R28388624