http://linkedlifedata.com/resource/umls/id/C0024141
type: T047
type: Concept
has correlation: LIVB
has correlation: ANAT
has correlation: DISO
has correlation: GENE
has correlation: PHEN
has correlation: PROC
has correlation: OBJC
has correlation: CONC
has correlation: OCCU
has correlation: ORGA
has correlation: CHEM
definition: MSH: A chronic, relapsing, inflammatory, and often febrile multisystemic disorder of connective tissue, characterized principally by involvement of the skin, joints, kidneys, and serosal membranes. It is of unknown etiology, but is thought to represent a failure of the regulatory mechanisms of the autoimmune system. The disease is marked by a wide range of system dysfunctions, an elevated erythrocyte sedimentation rate, and the formation of LE cells in the blood or bone marrow.,CSP: chronic, relapsing, inflammatory, and often febrile multisystemic disorder of connective tissue, characterized principally by involvement of the skin, joints, kidneys, and serosal membranes; it is of unknown etiology, but is thought to represent a failure of the regulatory mechanisms of the autoimmune system; the disease is marked by a wide range of system dysfunctions, an elevated erythrocyte sedimentation rate, and the formation of LE cells in the blood or bone marrow.,NCI: A chronic, inflammatory, connective tissue disease that
in scheme: umls
broader: http://linkedlifedata.com/resource/umls/id/C0009782
broader: http://linkedlifedata.com/resource/umls/id/C0004364
broader: http://linkedlifedata.com/resource/umls/id/C0037274
broader: http://linkedlifedata.com/resource/umls/id/C0009326
narrower: http://linkedlifedata.com/resource/umls/id/C0024143
narrower: http://linkedlifedata.com/resource/umls/id/C0521471
narrower: http://linkedlifedata.com/resource/umls/id/C0542297
narrower: http://linkedlifedata.com/resource/umls/id/C0409979
relation: R32172819
relation: R120354144
relation: R120354145
relation: R120354146
relation: R120354147
relation: R120354149
relation: R120354151
relation: R120354152
relation: R120354153
relation: R120354154
relation: R120354155
relation: R120354165
relation: R120354156
relation: R120354157
relation: R120354158
relation: R120354159
relation: R120354161
relation: R120354162
relation: R120354163
relation: R120354164
relation: R120354168
relation: R120354169
relation: R120354171
relation: R120354172
relation: R120354173
relation: R120354174
relation: R120354175
relation: R120354176
relation: R120354177
relation: R120354178
relation: R120354179
relation: R120354180
relation: R120354167
relation: R120354148
relation: R120354160
relation: R120354170
relation: R120354150
relation: R120354166
relation: R71340239
relation: R71112473
relation: R71204028
relation: R71275315
relation: R128857450
relation: R28388597
relation: R28388598
relation: R28388599
relation: R123295756
relation: R101251993
relation: R101251994
relation: R71122467
relation: R71012768
relation: R71176053
relation: R71300964
relation: R71025741
relation: R71080764
relation: R71355977
relation: R71341656