http://linkedlifedata.com/resource/umls/id/C0019046
type: T116
type: T123
type: Concept
has correlation: ANAT
has correlation: DISO
has correlation: PHYS
has correlation: PHEN
has correlation: PROC
has correlation: CONC
has correlation: CHEM
definition: MSH: The oxygen-carrying proteins of ERYTHROCYTES. They are found in all vertebrates and some invertebrates. The number of globin subunits in the hemoglobin quaternary structure differs between species. Structures range from monomeric to a variety of multimeric arrangements.,CSP: oxygen carrying pigment of the erythrocytes; a complex protein composed of four heme groups and four globin polypeptide chains.,NCI: The substance inside red blood cells that binds to oxygen in the lungs and carries it to the tissues.,NCI: The red respiratory protein of erythrocytes, consisting of approximately 3.8% heme and 96.2% globin (64.5 KD), which as oxyhemoglobin (HbO2) transports oxygen from the lungs to the tissues where the oxygen is readily released and HbO2 becomes Hb.
in scheme: umls
broader: http://linkedlifedata.com/resource/umls/id/C0005832
broader: http://linkedlifedata.com/resource/umls/id/C0033684
broader: http://linkedlifedata.com/resource/umls/id/C0007292
broader: http://linkedlifedata.com/resource/umls/id/C0017645
broader: http://linkedlifedata.com/resource/umls/id/C0018974
narrower: http://linkedlifedata.com/resource/umls/id/C0062119
narrower: http://linkedlifedata.com/resource/umls/id/C0019016
narrower: http://linkedlifedata.com/resource/umls/id/C0019020
narrower: http://linkedlifedata.com/resource/umls/id/C0019043
narrower: http://linkedlifedata.com/resource/umls/id/C0015936
narrower: http://linkedlifedata.com/resource/umls/id/C0057437
narrower: http://linkedlifedata.com/resource/umls/id/C0007061
narrower: http://linkedlifedata.com/resource/umls/id/C0017853
narrower: http://linkedlifedata.com/resource/umls/id/C0025635
narrower: http://linkedlifedata.com/resource/umls/id/C0030069
narrower: http://linkedlifedata.com/resource/umls/id/C0019026
narrower: http://linkedlifedata.com/resource/umls/id/C0019019
narrower: http://linkedlifedata.com/resource/umls/id/C0606551
narrower: http://linkedlifedata.com/resource/umls/id/C0052175
narrower: http://linkedlifedata.com/resource/umls/id/C0623643
narrower: http://linkedlifedata.com/resource/umls/id/C1309473
narrower: http://linkedlifedata.com/resource/umls/id/C0252444
narrower: http://linkedlifedata.com/resource/umls/id/C0082471
narrower: http://linkedlifedata.com/resource/umls/id/C0015891
narrower: http://linkedlifedata.com/resource/umls/id/C0682968
narrower: http://linkedlifedata.com/resource/umls/id/C2000553
narrower: http://linkedlifedata.com/resource/umls/id/C0912247
narrower: http://linkedlifedata.com/resource/umls/id/C0014730
narrower: http://linkedlifedata.com/resource/umls/id/C0050784
narrower: http://linkedlifedata.com/resource/umls/id/C0052777
narrower: http://linkedlifedata.com/resource/umls/id/C0056024
narrower: http://linkedlifedata.com/resource/umls/id/C0056041
narrower: http://linkedlifedata.com/resource/umls/id/C0056649
narrower: http://linkedlifedata.com/resource/umls/id/C0057619
narrower: http://linkedlifedata.com/resource/umls/id/C0062248
narrower: http://linkedlifedata.com/resource/umls/id/C0062418
narrower: http://linkedlifedata.com/resource/umls/id/C0062476
narrower: http://linkedlifedata.com/resource/umls/id/C0062478
narrower: http://linkedlifedata.com/resource/umls/id/C0062487
narrower: http://linkedlifedata.com/resource/umls/id/C0063048
narrower: http://linkedlifedata.com/resource/umls/id/C0065652
narrower: http://linkedlifedata.com/resource/umls/id/C0068873
narrower: http://linkedlifedata.com/resource/umls/id/C0071587
narrower: http://linkedlifedata.com/resource/umls/id/C0071588
narrower: http://linkedlifedata.com/resource/umls/id/C0078783
narrower: http://linkedlifedata.com/resource/umls/id/C0082846
narrower: http://linkedlifedata.com/resource/umls/id/C0102331
narrower: http://linkedlifedata.com/resource/umls/id/C0109312
narrower: http://linkedlifedata.com/resource/umls/id/C0121409
narrower: http://linkedlifedata.com/resource/umls/id/C0123968
narrower: http://linkedlifedata.com/resource/umls/id/C0167672
narrower: http://linkedlifedata.com/resource/umls/id/C0209012
narrower: http://linkedlifedata.com/resource/umls/id/C0212463
narrower: http://linkedlifedata.com/resource/umls/id/C0215199
narrower: http://linkedlifedata.com/resource/umls/id/C0217022
narrower: http://linkedlifedata.com/resource/umls/id/C0217024
narrower: http://linkedlifedata.com/resource/umls/id/C0219880
narrower: http://linkedlifedata.com/resource/umls/id/C0245921
narrower: http://linkedlifedata.com/resource/umls/id/C0247389
narrower: http://linkedlifedata.com/resource/umls/id/C0250445
narrower: http://linkedlifedata.com/resource/umls/id/C0251387
narrower: http://linkedlifedata.com/resource/umls/id/C0251389
narrower: http://linkedlifedata.com/resource/umls/id/C0252834
narrower: http://linkedlifedata.com/resource/umls/id/C0254489
narrower: http://linkedlifedata.com/resource/umls/id/C0254491
narrower: http://linkedlifedata.com/resource/umls/id/C0285562
narrower: http://linkedlifedata.com/resource/umls/id/C0299241
narrower: http://linkedlifedata.com/resource/umls/id/C0300427