http://linkedlifedata.com/resource/umls/id/C0016658
type: T037
type: Concept
has correlation: LIVB
has correlation: ANAT
has correlation: DISO
has correlation: PHYS
has correlation: PHEN
has correlation: ACTI
has correlation: PROC
has correlation: CONC
has correlation: OCCU
has correlation: CHEM
definition: CSP: breaks or rupture in bones or cartilages.,MEDLINEPLUS: A fracture is a break, usually in a bone. If the broken bone punctures the skin, it is called an open or compound fracture. Fractures commonly happen because of car accidents, falls or sports injuries. Other causes are low bone density and osteoporosis, which cause weakening of the bones. Overuse can cause stress fractures, which are very small cracks in the bone. Symptoms of a fracture are Out-of-place or misshapen limb or joint Swelling, bruising or bleeding Intense pain Numbness and tingling Limited mobility or inability to move a limb You need to get medical care right away for any fracture. You may need to wear a c
in scheme: umls
broader: http://linkedlifedata.com/resource/umls/id/C0449499
broader: http://linkedlifedata.com/resource/umls/id/C0272448
narrower: http://linkedlifedata.com/resource/umls/id/C0019557
narrower: http://linkedlifedata.com/resource/umls/id/C0596838
narrower: http://linkedlifedata.com/resource/umls/id/C0332716
narrower: http://linkedlifedata.com/resource/umls/id/C0332758
narrower: http://linkedlifedata.com/resource/umls/id/C0679355
relation: R05299548
relation: R05299549
relation: R05299552
relation: R05299550
relation: R05299551
relation: R05300663
relation: R05302107
relation: R05302106
relation: R05302108
relation: R05302110
relation: R05302111
relation: R05302116
relation: R05302109
relation: R44102409
relation: R05302114
relation: R44102408
relation: R05302112
relation: R05203319
relation: R05203322
relation: R05203321
relation: R05203320
relation: R05203323
relation: R05217650
relation: R00690588
relation: R00690589
relation: R00708294
relation: R00708289
relation: R00708292
relation: R00708291
relation: R00708290
relation: R00708293
relation: R05235267
relation: R05235268
relation: R05235269
relation: R05235270
relation: R05235266
relation: R05657903
relation: R05657904
relation: R44003724
relation: R43978165
relation: R00901288
relation: R00901289
relation: R00911736
relation: R00911737
relation: R44023529
relation: R05685540
relation: R05685541
relation: R00945739
relation: R78257931
relation: R60606876
relation: R60605187
relation: R78255653
relation: R60734188
relation: R108507246
relation: R60577203
relation: R60492473
relation: R125080937
relation: R00750750
relation: R00750748