http://linkedlifedata.com/resource/umls/id/C0015684
type: T119
type: Concept
has correlation: ANAT
has correlation: GENE
has correlation: PHYS
has correlation: PHEN
has correlation: PROC
has correlation: OBJC
has correlation: CONC
has correlation: CHEM
definition: MSH: Organic, monobasic acids derived from hydrocarbons by the equivalent of oxidation of a methyl group to an alcohol, aldehyde, and then acid. Fatty acids are saturated and unsaturated (FATTY ACIDS, UNSATURATED). (Grant & Hackh's Chemical Dictionary, 5th ed),CSP: organic, monobasic acids derived from hydrocarbons by the equivalent of oxidation of a methyl group to an alcohol, aldehyde, and then acid; chemically R COOH where R is an aliphatic moiety; the common fatty acids of biological origin are linear chains with an even number of carbon atoms.,CHV: a major component of fats,CHV: a major component of fats,NCI: A major component of fats that are used by the body for energy and tissue development.,NCI: Monobasic, aliphatic acids with varying chain lengths between 6 and 30. Fatty acids are a major constituent in all fats and can be either saturated, monounsaturated, or polyunsaturated. Saturated and monounsaturated fatty acids are synthesized by the body, whereas polyunsaturated fatty acids are not and must
in scheme: umls
broader: http://linkedlifedata.com/resource/umls/id/C0023779
broader: http://linkedlifedata.com/resource/umls/id/C0682952
broader: http://linkedlifedata.com/resource/umls/id/C0002052
narrower: http://linkedlifedata.com/resource/umls/id/C0015688
narrower: http://linkedlifedata.com/resource/umls/id/C0015690
narrower: http://linkedlifedata.com/resource/umls/id/C0015691
narrower: http://linkedlifedata.com/resource/umls/id/C0027138
narrower: http://linkedlifedata.com/resource/umls/id/C0030234
narrower: http://linkedlifedata.com/resource/umls/id/C0033569
narrower: http://linkedlifedata.com/resource/umls/id/C0037530
narrower: http://linkedlifedata.com/resource/umls/id/C0522095
narrower: http://linkedlifedata.com/resource/umls/id/C0369212
narrower: http://linkedlifedata.com/resource/umls/id/C0038229
narrower: http://linkedlifedata.com/resource/umls/id/C0597423
narrower: http://linkedlifedata.com/resource/umls/id/C0023139
narrower: http://linkedlifedata.com/resource/umls/id/C0046565
narrower: http://linkedlifedata.com/resource/umls/id/C0057239
narrower: http://linkedlifedata.com/resource/umls/id/C0070210
narrower: http://linkedlifedata.com/resource/umls/id/C0253029
narrower: http://linkedlifedata.com/resource/umls/id/C0443770
narrower: http://linkedlifedata.com/resource/umls/id/C0073603
narrower: http://linkedlifedata.com/resource/umls/id/C0037854
narrower: http://linkedlifedata.com/resource/umls/id/C0075850
narrower: http://linkedlifedata.com/resource/umls/id/C0075851
narrower: http://linkedlifedata.com/resource/umls/id/C0075852
narrower: http://linkedlifedata.com/resource/umls/id/C0815035
narrower: http://linkedlifedata.com/resource/umls/id/C0535987
narrower: http://linkedlifedata.com/resource/umls/id/C0075483
narrower: http://linkedlifedata.com/resource/umls/id/C0059084
narrower: http://linkedlifedata.com/resource/umls/id/C2930456
narrower: http://linkedlifedata.com/resource/umls/id/C0057242
narrower: http://linkedlifedata.com/resource/umls/id/C0068937
narrower: http://linkedlifedata.com/resource/umls/id/C1121788
narrower: http://linkedlifedata.com/resource/umls/id/C0388882
narrower: http://linkedlifedata.com/resource/umls/id/C0053073
narrower: http://linkedlifedata.com/resource/umls/id/C0388040
narrower: http://linkedlifedata.com/resource/umls/id/C0529612
narrower: http://linkedlifedata.com/resource/umls/id/C0910455
narrower: http://linkedlifedata.com/resource/umls/id/C0910457
narrower: http://linkedlifedata.com/resource/umls/id/C0604054
narrower: http://linkedlifedata.com/resource/umls/id/C0646611
narrower: http://linkedlifedata.com/resource/umls/id/C1121422
narrower: http://linkedlifedata.com/resource/umls/id/C0044720
narrower: http://linkedlifedata.com/resource/umls/id/C0629496
narrower: http://linkedlifedata.com/resource/umls/id/C0065724
narrower: http://linkedlifedata.com/resource/umls/id/C0047597
narrower: http://linkedlifedata.com/resource/umls/id/C0044870
narrower: http://linkedlifedata.com/resource/umls/id/C0644735
narrower: http://linkedlifedata.com/resource/umls/id/C0044738
narrower: http://linkedlifedata.com/resource/umls/id/C0044906
narrower: http://linkedlifedata.com/resource/umls/id/C0050279
narrower: http://linkedlifedata.com/resource/umls/id/C0052563
narrower: http://linkedlifedata.com/resource/umls/id/C0055109
narrower: http://linkedlifedata.com/resource/umls/id/C0055276
narrower: http://linkedlifedata.com/resource/umls/id/C0056806
narrower: http://linkedlifedata.com/resource/umls/id/C0058115
narrower: http://linkedlifedata.com/resource/umls/id/C0060099
narrower: http://linkedlifedata.com/resource/umls/id/C0062609
narrower: http://linkedlifedata.com/resource/umls/id/C0063054
narrower: http://linkedlifedata.com/resource/umls/id/C0064975
narrower: http://linkedlifedata.com/resource/umls/id/C0065030
narrower: http://linkedlifedata.com/resource/umls/id/C0066352
narrower: http://linkedlifedata.com/resource/umls/id/C0067008
narrower: http://linkedlifedata.com/resource/umls/id/C0069165
narrower: http://linkedlifedata.com/resource/umls/id/C0071016
narrower: http://linkedlifedata.com/resource/umls/id/C0071987
narrower: http://linkedlifedata.com/resource/umls/id/C0077819
narrower: http://linkedlifedata.com/resource/umls/id/C0078051