http://linkedlifedata.com/resource/umls/id/C0014442
type: T109
type: T126
type: Concept
has correlation: ANAT
has correlation: DISO
has correlation: GENE
has correlation: PHYS
has correlation: PHEN
has correlation: PROC
has correlation: OBJC
has correlation: CONC
has correlation: CHEM
definition: MSH: Biological molecules that possess catalytic activity. They may occur naturally or be synthetically created. Enzymes are usually proteins, however CATALYTIC RNA and CATALYTIC DNA molecules have also been identified.,CSP: protein molecules that possess catalytic activity; they may occur naturally or be synthetically created; for catalytic RNA use RIBOZYME.,NCI: A protein that speeds up chemical reactions in the body.,NCI: Molecules that catalyze a chemical reaction. They are usually proteins, although catalytic RNA and DNA molecules have been identified.
in scheme: umls
broader: http://linkedlifedata.com/resource/umls/id/C0029224
broader: http://linkedlifedata.com/resource/umls/id/C0576728
narrower: http://linkedlifedata.com/resource/umls/id/C0026741
narrower: http://linkedlifedata.com/resource/umls/id/C0014444
narrower: http://linkedlifedata.com/resource/umls/id/C0020289
narrower: http://linkedlifedata.com/resource/umls/id/C0022173
narrower: http://linkedlifedata.com/resource/umls/id/C0022202
narrower: http://linkedlifedata.com/resource/umls/id/C0023689
narrower: http://linkedlifedata.com/resource/umls/id/C0024188
narrower: http://linkedlifedata.com/resource/umls/id/C0030016
narrower: http://linkedlifedata.com/resource/umls/id/C0040676
narrower: http://linkedlifedata.com/resource/umls/id/C0920330
narrower: http://linkedlifedata.com/resource/umls/id/C0596543
narrower: http://linkedlifedata.com/resource/umls/id/C0596732
narrower: http://linkedlifedata.com/resource/umls/id/C0596918
narrower: http://linkedlifedata.com/resource/umls/id/C0597391
narrower: http://linkedlifedata.com/resource/umls/id/C0597548
narrower: http://linkedlifedata.com/resource/umls/id/C0244528
narrower: http://linkedlifedata.com/resource/umls/id/C0757238
narrower: http://linkedlifedata.com/resource/umls/id/C0065360
narrower: http://linkedlifedata.com/resource/umls/id/C2936677
narrower: http://linkedlifedata.com/resource/umls/id/C1673259
narrower: http://linkedlifedata.com/resource/umls/id/C1121217
narrower: http://linkedlifedata.com/resource/umls/id/C1527524
narrower: http://linkedlifedata.com/resource/umls/id/C0621927
narrower: http://linkedlifedata.com/resource/umls/id/C0057667
narrower: http://linkedlifedata.com/resource/umls/id/C0064520
narrower: http://linkedlifedata.com/resource/umls/id/C0062500
narrower: http://linkedlifedata.com/resource/umls/id/C0647411
narrower: http://linkedlifedata.com/resource/umls/id/C0055514
narrower: http://linkedlifedata.com/resource/umls/id/C0064733
narrower: http://linkedlifedata.com/resource/umls/id/C0069052
narrower: http://linkedlifedata.com/resource/umls/id/C0257349
narrower: http://linkedlifedata.com/resource/umls/id/C0285251
narrower: http://linkedlifedata.com/resource/umls/id/C0617073
narrower: http://linkedlifedata.com/resource/umls/id/C0617367
narrower: http://linkedlifedata.com/resource/umls/id/C0618819
narrower: http://linkedlifedata.com/resource/umls/id/C0619289
narrower: http://linkedlifedata.com/resource/umls/id/C0625086
narrower: http://linkedlifedata.com/resource/umls/id/C0641999
narrower: http://linkedlifedata.com/resource/umls/id/C0964518
narrower: http://linkedlifedata.com/resource/umls/id/C1434880
relation: R120279800
relation: R120279801
relation: R120279803
relation: R120279804
relation: R120279805
relation: R120279806
relation: R120279807
relation: R120279809
relation: R120279811
relation: R120279812
relation: R120279813
relation: R120279815
relation: R120279816
relation: R120279817
relation: R120279819
relation: R120279820
relation: R120279821
relation: R120279822
relation: R120279823
relation: R120279824
relation: R120279825
relation: R120279826
relation: R120279827
relation: R120279828