http://linkedlifedata.com/resource/umls/id/C0012634
type: T047
type: Concept
has correlation: LIVB
has correlation: ANAT
has correlation: DISO
has correlation: PHYS
has correlation: PHEN
has correlation: ACTI
has correlation: PROC
has correlation: CONC
has correlation: OCCU
has correlation: CHEM
definition: MSH: A definite pathologic process with a characteristic set of signs and symptoms. It may affect the whole body or any of its parts, and its etiology, pathology, and prognosis may be known or unknown.,NCI: Any abnormal condition of the body or mind that causes discomfort, dysfunction, or distress to the person affected or those in contact with the person. The term is often used broadly to include injuries, disabilities, syndromes, symptoms, deviant behaviors, and atypical variations of structure and function.,CSP: top term heading for all specific disorders and diseases; a disease is a deviation from or interruption of the normal structure or function of any part, organ or system (or combination thereof) of the body that is manifested by a characteristic set of symptoms and signs; a disorder is a derangement or abnormality of function.,NCI: In medicine, a health problem with certain characteristics or symptoms.
in scheme: umls
narrower: http://linkedlifedata.com/resource/umls/id/C0021311
narrower: http://linkedlifedata.com/resource/umls/id/C0009782
narrower: http://linkedlifedata.com/resource/umls/id/C1113651
narrower: http://linkedlifedata.com/resource/umls/id/C0242354
narrower: http://linkedlifedata.com/resource/umls/id/C0015397
narrower: http://linkedlifedata.com/resource/umls/id/C0013447
narrower: http://linkedlifedata.com/resource/umls/id/C0012242
narrower: http://linkedlifedata.com/resource/umls/id/C0014130
narrower: http://linkedlifedata.com/resource/umls/id/C0019247
narrower: http://linkedlifedata.com/resource/umls/id/C0037274
narrower: http://linkedlifedata.com/resource/umls/id/C0025517
narrower: http://linkedlifedata.com/resource/umls/id/C0024228
narrower: http://linkedlifedata.com/resource/umls/id/C0035204
narrower: http://linkedlifedata.com/resource/umls/id/C0018939
narrower: http://linkedlifedata.com/resource/umls/id/C0026857
narrower: http://linkedlifedata.com/resource/umls/id/C0042075
narrower: http://linkedlifedata.com/resource/umls/id/C0178829
narrower: http://linkedlifedata.com/resource/umls/id/C0007222
narrower: http://linkedlifedata.com/resource/umls/id/C0027765
narrower: http://linkedlifedata.com/resource/umls/id/C0028709
narrower: http://linkedlifedata.com/resource/umls/id/C0039082
narrower: http://linkedlifedata.com/resource/umls/id/C1609432
narrower: http://linkedlifedata.com/resource/umls/id/C0149676
narrower: http://linkedlifedata.com/resource/umls/id/C0032080
relation: R28409305
relation: R28493362
relation: R64559022
relation: R120267381
relation: R120267382
relation: R120267383
relation: R120267384
relation: R120267385
relation: R120267386
relation: R120267387
relation: R71119504
relation: R71367793
relation: R71192491
relation: R71192197
relation: R71192325
relation: R71413570
relation: R71137635
relation: R71082399
relation: R71276621
relation: R71276622
relation: R71166074
relation: R71221213
relation: R71276629
relation: R71056211
relation: R71221219
relation: R71166081
relation: R71276630
relation: R71276631
relation: R71056212
relation: R71166082
relation: R71331535
relation: R71111242
relation: R71166094
relation: R71166089
relation: R71221232
relation: R71111253
relation: R71111254
relation: R71221233
relation: R71001408
relation: R71111255
relation: R71331541
relation: R71001409