http://linkedlifedata.com/resource/umls/id/C0011860
type: T047
type: Concept
has correlation: LIVB
has correlation: ANAT
has correlation: DISO
has correlation: GENE
has correlation: PHYS
has correlation: PHEN
has correlation: PROC
has correlation: DEVI
has correlation: CONC
has correlation: CHEM
definition: CSP: subclass of diabetes mellitus that is not insulin responsive or dependent; characterized initially by insulin resistance and hyperinsulinemia and eventually by glucose intolerance, hyperglycemia, and overt diabetes; type II diabetes mellitus is no longer considered a disease exclusively found in adults; patients seldom develop ketosis but often exhibit obesity.,NCI: A type of diabetes mellitus that is characterized by insulin resistance or desensitization and increased blood glucose levels. This is a chronic disease that can develop gradually over the life of a patient and can be linked to both environmental factors and heredity.,MEDLINEPLUS: Diabetes means your blood glucose, or blood sugar, is too high. With Type 2 diabetes, the more common type, your body does not make or use insulin well. Insulin is a hormone that helps glucose get into your cells to give them energy. Without insulin, too much glucose stays in your blood. Over time, hi
in scheme: umls
broader: http://linkedlifedata.com/resource/umls/id/C0011849
broader: http://linkedlifedata.com/resource/umls/id/C0028715
relation: R28410959
relation: R28419094
relation: R28492896
relation: R28492897
relation: R28419097
relation: R28492904
relation: R28492905
relation: R03688906
relation: R28492907
relation: R28428156
relation: R44026362
relation: R28432403
relation: R28440732
relation: R28452129
relation: R28529020
relation: R28453303
relation: R28529833
relation: R05673737
relation: R00894715
relation: R00913914
relation: R00913915
relation: R44024772
relation: R43987854
relation: R43987855
relation: R43987856
relation: R48839323
relation: R43987857
relation: R05726710
relation: R05726706
relation: R05726705
relation: R05726707
relation: R05726708
relation: R05726709
relation: R05726712
relation: R05726711
relation: R05726713
relation: R05726715
relation: R05726714
relation: R28459038
relation: R28535130
relation: R28535131
relation: R28460718
relation: R60668413
relation: R60749993
relation: R60548593
relation: R60581560
relation: R60714507
relation: R60603521
relation: R60538438
relation: R60596785
relation: R60625512
relation: R60683826
relation: R60567564
relation: R60639306
relation: R60610548
relation: R113859651
relation: R04600154
relation: R04610095
relation: R64568406
relation: R00747702
relation: R00747703
relation: R00747704
relation: R00751751
relation: R43995901