http://linkedlifedata.com/resource/umls/id/C0010592
type: T116
type: T121
type: Concept
has correlation: ANAT
has correlation: DISO
has correlation: PHYS
has correlation: PHEN
has correlation: PROC
has correlation: CONC
has correlation: CHEM
definition: MSH: A cyclic undecapeptide from an extract of soil fungi. It is a powerful immunosupressant with a specific action on T-lymphocytes. It is used for the prophylaxis of graft rejection in organ and tissue transplantation. (From Martindale, The Extra Pharmacopoeia, 30th ed).,CSP: 11-residue cyclic peptide produced by certain fungi which has antifungal and T cell specific immunosuppressive properties.,NCI: A drug used to help reduce the risk of rejection of organ and bone marrow transplants by the body. It is also used in clinical trials to make cancer cells more sensitive to anticancer drugs.,CHV: A drug used to help reduce the risk of rejection of organ and bone marrow transplants by the body,CHV: A drug used to help reduce the risk of rejection of organ and bone marrow transplants by the body,CHV: A drug used to help reduce the risk of rejection of organ and bone marrow transplants by the body,CHV: A drug used to help reduce the risk of rejection of organ and bone marrow transplants by the body,CHV: A drug us
in scheme: umls
broader: http://linkedlifedata.com/resource/umls/id/C0003308
broader: http://linkedlifedata.com/resource/umls/id/C0011625
broader: http://linkedlifedata.com/resource/umls/id/C0003191
broader: http://linkedlifedata.com/resource/umls/id/C0014432
broader: http://linkedlifedata.com/resource/umls/id/C0021081
broader: http://linkedlifedata.com/resource/umls/id/C0030957
narrower: http://linkedlifedata.com/resource/umls/id/C0056822
narrower: http://linkedlifedata.com/resource/umls/id/C0056823
narrower: http://linkedlifedata.com/resource/umls/id/C0251403
narrower: http://linkedlifedata.com/resource/umls/id/C0290852
narrower: http://linkedlifedata.com/resource/umls/id/C0293589
narrower: http://linkedlifedata.com/resource/umls/id/C0380909
narrower: http://linkedlifedata.com/resource/umls/id/C0386744
narrower: http://linkedlifedata.com/resource/umls/id/C0529527
narrower: http://linkedlifedata.com/resource/umls/id/C0538964
narrower: http://linkedlifedata.com/resource/umls/id/C0539119
narrower: http://linkedlifedata.com/resource/umls/id/C0699602
narrower: http://linkedlifedata.com/resource/umls/id/C0699603
narrower: http://linkedlifedata.com/resource/umls/id/C0699604
narrower: http://linkedlifedata.com/resource/umls/id/C0699605
narrower: http://linkedlifedata.com/resource/umls/id/C0723210
narrower: http://linkedlifedata.com/resource/umls/id/C0771305
narrower: http://linkedlifedata.com/resource/umls/id/C0876043
narrower: http://linkedlifedata.com/resource/umls/id/C0878526
narrower: http://linkedlifedata.com/resource/umls/id/C1170584
narrower: http://linkedlifedata.com/resource/umls/id/C1451579
narrower: http://linkedlifedata.com/resource/umls/id/C1522536
narrower: http://linkedlifedata.com/resource/umls/id/C1567950
narrower: http://linkedlifedata.com/resource/umls/id/C1577018
narrower: http://linkedlifedata.com/resource/umls/id/C1601186
narrower: http://linkedlifedata.com/resource/umls/id/C1614668
narrower: http://linkedlifedata.com/resource/umls/id/C1721438
narrower: http://linkedlifedata.com/resource/umls/id/C2002885
narrower: http://linkedlifedata.com/resource/umls/id/C2607219
narrower: http://linkedlifedata.com/resource/umls/id/C2980694
relation: R112184908
relation: R112184909
relation: R112184910
relation: R112184911
relation: R32109487
relation: R32109488
relation: R32109489
relation: R32109490
relation: R32109491
relation: R32109492
relation: R120527268
relation: R120527269
relation: R120527271
relation: R120527272
relation: R120527273
relation: R120527274
relation: R120527275
relation: R120527276
relation: R120527277
relation: R120527278
relation: R120527280
relation: R120527281
relation: R120527282
relation: R120527284
relation: R120527285
relation: R120527286
relation: R120527287
relation: R120527288
relation: R120527289
relation: R120527290
relation: R120527291
relation: R120527292
relation: R120527293