http://linkedlifedata.com/resource/umls/id/C0009450
type: T047
type: Concept
has correlation: LIVB
has correlation: ANAT
has correlation: DISO
has correlation: PHYS
has correlation: PHEN
has correlation: PROC
has correlation: OBJC
has correlation: DEVI
has correlation: CONC
has correlation: OCCU
has correlation: ORGA
has correlation: CHEM
definition: CSP: broad class of diseases whose causative agents may be passed between individuals in many different ways.,NCI: Invasion and multiplication of germs in the body. Infections can occur in any part of the body and can spread throughout the body. The germs may be bacteria, viruses, yeast, or fungi. They can cause a fever and other problems, depending on where the infection occurs. When the body's natural defense system is strong, it can often fight the germs and prevent infection. Some cancer treatments can weaken the natural defense system.,NCI: A disorder resulting from the presence and activity of a microbial, viral, or parasitic agent. It can be transmitted by direct or indirect contact. -- 2003 (NCI),MEDLINEPLUS: Infectious diseases kill more people worldwide than any other single cause. Infectious diseases are caused by germs. Germs are tiny living things that are found everywhere - in air, soil and water. You can get infected by touching, <a href='http://www.nlm.nih.gov/medlineplus/foodborneillness.h
in scheme: umls
broader: http://linkedlifedata.com/resource/umls/id/C0021311
narrower: http://linkedlifedata.com/resource/umls/id/C0521829
narrower: http://linkedlifedata.com/resource/umls/id/C0872315
narrower: http://linkedlifedata.com/resource/umls/id/C0036916
narrower: http://linkedlifedata.com/resource/umls/id/C0042769
narrower: http://linkedlifedata.com/resource/umls/id/C0004623
narrower: http://linkedlifedata.com/resource/umls/id/C0026946
narrower: http://linkedlifedata.com/resource/umls/id/C0030499
narrower: http://linkedlifedata.com/resource/umls/id/C0029118
narrower: http://linkedlifedata.com/resource/umls/id/C0277525
narrower: http://linkedlifedata.com/resource/umls/id/C0699744
narrower: http://linkedlifedata.com/resource/umls/id/C0205721
narrower: http://linkedlifedata.com/resource/umls/id/C0003869
narrower: http://linkedlifedata.com/resource/umls/id/C0157749
narrower: http://linkedlifedata.com/resource/umls/id/C0031154
narrower: http://linkedlifedata.com/resource/umls/id/C0348165
narrower: http://linkedlifedata.com/resource/umls/id/C0752180
narrower: http://linkedlifedata.com/resource/umls/id/C0043528
narrower: http://linkedlifedata.com/resource/umls/id/C0679373
narrower: http://linkedlifedata.com/resource/umls/id/C0679361
narrower: http://linkedlifedata.com/resource/umls/id/C0442886
narrower: http://linkedlifedata.com/resource/umls/id/C0872054
narrower: http://linkedlifedata.com/resource/umls/id/C0814151
relation: R28416788
relation: R28490714
relation: R28490715
relation: R28490716
relation: R64558100
relation: R120245408
relation: R120245409
relation: R120245410
relation: R120245411
relation: R120245413
relation: R120245415
relation: R120245416
relation: R120245417
relation: R120245418
relation: R120245419
relation: R120245429
relation: R120245420
relation: R120245421
relation: R120245422
relation: R120245423
relation: R120245425
relation: R120245426
relation: R120245427
relation: R120245428
relation: R120245432
relation: R120245434
relation: R120245435
relation: R120245436
relation: R120245437
relation: R120245438
relation: R120245439
relation: R120245440
relation: R120245441
relation: R120245442
relation: R120245443
relation: R120245444
relation: R120245431
relation: R120245412
relation: R120245424
relation: R120245433
relation: R120245414