http://linkedlifedata.com/resource/umls/id/C0009325
type: T116
type: T122
type: T123
type: Concept
has correlation: ANAT
has correlation: GENE
has correlation: PHYS
has correlation: PHEN
has correlation: PROC
has correlation: OBJC
has correlation: DEVI
has correlation: CONC
has correlation: CHEM
definition: MSH: A polypeptide substance comprising about one third of the total protein in mammalian organisms. It is the main constituent of SKIN; CONNECTIVE TISSUE; and the organic substance of bones (BONE AND BONES) and teeth (TOOTH).,CSP: principle protein of connective tissue; unusual absence of sulfur aminoacids; unique presence of hydroxyproline is believed to permit a triple helical fibrous structure.,NCI: A fibrous protein found in cartilage and other connective tissue.,NCI: A family of large fibrous proteins that are the main components of connective tissue and are responsible for maintaining tissue structure.
in scheme: umls
broader: http://linkedlifedata.com/resource/umls/id/C0079323
broader: http://linkedlifedata.com/resource/umls/id/C0036425
narrower: http://linkedlifedata.com/resource/umls/id/C0065749
narrower: http://linkedlifedata.com/resource/umls/id/C0009336
narrower: http://linkedlifedata.com/resource/umls/id/C0086030
narrower: http://linkedlifedata.com/resource/umls/id/C0969669
narrower: http://linkedlifedata.com/resource/umls/id/C0969670
narrower: http://linkedlifedata.com/resource/umls/id/C0033235
narrower: http://linkedlifedata.com/resource/umls/id/C0251813
narrower: http://linkedlifedata.com/resource/umls/id/C1505188
narrower: http://linkedlifedata.com/resource/umls/id/C1431449
narrower: http://linkedlifedata.com/resource/umls/id/C1432731
narrower: http://linkedlifedata.com/resource/umls/id/C0733516
narrower: http://linkedlifedata.com/resource/umls/id/C0764680
narrower: http://linkedlifedata.com/resource/umls/id/C0661060
narrower: http://linkedlifedata.com/resource/umls/id/C2605281
narrower: http://linkedlifedata.com/resource/umls/id/C2607536
narrower: http://linkedlifedata.com/resource/umls/id/C0002256
narrower: http://linkedlifedata.com/resource/umls/id/C0060788
narrower: http://linkedlifedata.com/resource/umls/id/C1447932
narrower: http://linkedlifedata.com/resource/umls/id/C1456777
narrower: http://linkedlifedata.com/resource/umls/id/C0009327
narrower: http://linkedlifedata.com/resource/umls/id/C0009343
narrower: http://linkedlifedata.com/resource/umls/id/C0025975
narrower: http://linkedlifedata.com/resource/umls/id/C0052591
narrower: http://linkedlifedata.com/resource/umls/id/C0056114
narrower: http://linkedlifedata.com/resource/umls/id/C0056157
narrower: http://linkedlifedata.com/resource/umls/id/C0059013
narrower: http://linkedlifedata.com/resource/umls/id/C0061692
narrower: http://linkedlifedata.com/resource/umls/id/C0065351
narrower: http://linkedlifedata.com/resource/umls/id/C0071921
narrower: http://linkedlifedata.com/resource/umls/id/C0074801
narrower: http://linkedlifedata.com/resource/umls/id/C0082067
narrower: http://linkedlifedata.com/resource/umls/id/C0119542
narrower: http://linkedlifedata.com/resource/umls/id/C0164087
narrower: http://linkedlifedata.com/resource/umls/id/C0169202
narrower: http://linkedlifedata.com/resource/umls/id/C0169611
narrower: http://linkedlifedata.com/resource/umls/id/C0255139
narrower: http://linkedlifedata.com/resource/umls/id/C0284707
narrower: http://linkedlifedata.com/resource/umls/id/C0297741
narrower: http://linkedlifedata.com/resource/umls/id/C0381157
narrower: http://linkedlifedata.com/resource/umls/id/C0528923
narrower: http://linkedlifedata.com/resource/umls/id/C0533344
narrower: http://linkedlifedata.com/resource/umls/id/C0535059
narrower: http://linkedlifedata.com/resource/umls/id/C0535061
narrower: http://linkedlifedata.com/resource/umls/id/C0535062
narrower: http://linkedlifedata.com/resource/umls/id/C0539912
narrower: http://linkedlifedata.com/resource/umls/id/C0603836
narrower: http://linkedlifedata.com/resource/umls/id/C0614125
narrower: http://linkedlifedata.com/resource/umls/id/C0624483
narrower: http://linkedlifedata.com/resource/umls/id/C0633354
narrower: http://linkedlifedata.com/resource/umls/id/C0638044
narrower: http://linkedlifedata.com/resource/umls/id/C0641132
narrower: http://linkedlifedata.com/resource/umls/id/C0655023
narrower: http://linkedlifedata.com/resource/umls/id/C0657981
narrower: http://linkedlifedata.com/resource/umls/id/C0660085
narrower: http://linkedlifedata.com/resource/umls/id/C0666721
narrower: http://linkedlifedata.com/resource/umls/id/C0671677
narrower: http://linkedlifedata.com/resource/umls/id/C0673752
narrower: http://linkedlifedata.com/resource/umls/id/C0733515
narrower: http://linkedlifedata.com/resource/umls/id/C0733517
narrower: http://linkedlifedata.com/resource/umls/id/C0733518
narrower: http://linkedlifedata.com/resource/umls/id/C0733519
narrower: http://linkedlifedata.com/resource/umls/id/C0733520
narrower: http://linkedlifedata.com/resource/umls/id/C0758247