http://linkedlifedata.com/resource/umls/id/C0007097
type: T191
type: Concept
has correlation: ANAT
has correlation: DISO
has correlation: GENE
has correlation: PHEN
has correlation: PROC
has correlation: CONC
has correlation: CHEM
definition: MSH: A malignant neoplasm made up of epithelial cells tending to infiltrate the surrounding tissues and give rise to metastases. It is a histological type of neoplasm but is often wrongly used as a synonym for "cancer." (From Dorland, 27th ed),CSP: malignant new growth arising from epithelial cells tending to infiltrate the surrounding tissues and give rise to metastases.,NCI: Cancer that begins in the skin or in tissues that line or cover internal organs.,CHV: type of cancer,CHV: type of cancer,CHV: type of cancer,CHV: type of cancer,NCI: A malignant epithelial neoplasm.,NCI: A malignant tumor arising from epithelial cells. Carcinomas that arise from glandular epithelium are called adenocarcinomas, those that arise from squamous epithelium are called squamous cell carcinomas, and those that arise from transitional epithelium are called transitional cell carcinomas. Morphologically, the malignant epithelial cells may display abnormal mitotic figures, anaplasia, and necrosis. Carcinomas are graded by the degre
in scheme: umls
broader: http://linkedlifedata.com/resource/umls/id/C0027651
broader: http://linkedlifedata.com/resource/umls/id/C1368683
narrower: http://linkedlifedata.com/resource/umls/id/C0001418
narrower: http://linkedlifedata.com/resource/umls/id/C0007117
narrower: http://linkedlifedata.com/resource/umls/id/C0007118
narrower: http://linkedlifedata.com/resource/umls/id/C0007121
narrower: http://linkedlifedata.com/resource/umls/id/C0007131
narrower: http://linkedlifedata.com/resource/umls/id/C0007137
narrower: http://linkedlifedata.com/resource/umls/id/C0007138
narrower: http://linkedlifedata.com/resource/umls/id/C0149925
narrower: http://linkedlifedata.com/resource/umls/id/C0205697
narrower: http://linkedlifedata.com/resource/umls/id/C0205699
narrower: http://linkedlifedata.com/resource/umls/id/C0334371
narrower: http://linkedlifedata.com/resource/umls/id/C1710096
narrower: http://linkedlifedata.com/resource/umls/id/C0007125
narrower: http://linkedlifedata.com/resource/umls/id/C0008497
narrower: http://linkedlifedata.com/resource/umls/id/C0597035
narrower: http://linkedlifedata.com/resource/umls/id/C2931038
relation: R28488763
relation: R32099057
relation: R32099058
relation: R32171673
relation: R32171674
relation: R120226090
relation: R120226091
relation: R120226092
relation: R120226093
relation: R120226094
relation: R120226096
relation: R120226098
relation: R120226099
relation: R120226100
relation: R120226101
relation: R120226102
relation: R120226112
relation: R120226103
relation: R120226104
relation: R120226105
relation: R120226106
relation: R120226108
relation: R120226109
relation: R120226110
relation: R120226111
relation: R120226115
relation: R120226116
relation: R120226118
relation: R120226119
relation: R120226120
relation: R120226121
relation: R120226123
relation: R120226124
relation: R120226125
relation: R120226126
relation: R120226127
relation: R120226128
relation: R120226130
relation: R120226129
relation: R120226131
relation: R120226114
relation: R120226095
relation: R120226107
relation: R120226122
relation: R120226117
relation: R120226097
relation: R120226113
relation: R71073776
relation: R71184015
relation: R71121427
relation: R71003116