http://linkedlifedata.com/resource/umls/id/C0004096
type: T047
type: Concept
has correlation: LIVB
has correlation: ANAT
has correlation: DISO
has correlation: GENE
has correlation: PHYS
has correlation: PHEN
has correlation: PROC
has correlation: OBJC
has correlation: DEVI
has correlation: CONC
has correlation: OCCU
has correlation: ORGA
has correlation: CHEM
definition: MSH: A form of bronchial disorder with three distinct components: airway hyper-responsiveness (RESPIRATORY HYPERSENSITIVITY), airway INFLAMMATION, and intermittent AIRWAY OBSTRUCTION. It is characterized by spasmodic contraction of airway smooth muscle, WHEEZING, and dyspnea (DYSPNEA, PAROXYSMAL).,CSP: form of bronchial disorder associated with airway obstruction, marked by recurrent attacks of paroxysmal dyspnea, with wheezing due to spasmodic contraction of the bronchi.,MEDLINEPLUS: Asthma is a chronic disease that affects your airways. Your airways are tubes that carry air in and out of your lungs. If you have asthma, the inside walls of your airways become sore and swollen. That makes them very sensitive, and they may react strongly to things that you are allergic to or find irritating. When your airways react, they get narrower and your lungs get less air. This can cause wheezing, coughing, chest tightness and trouble breathing, especially
in scheme: umls
broader: http://linkedlifedata.com/resource/umls/id/C0035204
relation: R05299528
relation: R05299529
relation: R05300643
relation: R05302002
relation: R05301995
relation: R05301998
relation: R44102394
relation: R44102395
relation: R44102393
relation: R05302000
relation: R05302001
relation: R111921085
relation: R111874879
relation: R111874872
relation: R134141917
relation: R111874868
relation: R134141921
relation: R111874870
relation: R134141931
relation: R134141925
relation: R134141927
relation: R111874878
relation: R134141919
relation: R134141923
relation: R134141929
relation: R134141933
relation: R111921577
relation: R06493903
relation: R06493904
relation: R28486077
relation: R120204821
relation: R120204822
relation: R120204823
relation: R120204824
relation: R120204826
relation: R120204828
relation: R120204829
relation: R120204830
relation: R120204831
relation: R120204832
relation: R120204842
relation: R120204833
relation: R120204834
relation: R120204835
relation: R120204836
relation: R120204838
relation: R120204839
relation: R120204840
relation: R120204841
relation: R120204845
relation: R120204846
relation: R120204848
relation: R120204849
relation: R120204850
relation: R120204851
relation: R120204852
relation: R120204853
relation: R120204854
relation: R120204855
relation: R120204856
relation: R120204857
relation: R120204844