http://linkedlifedata.com/resource/umls/id/C0002520
type: T116
type: T121
type: T123
type: Concept
has correlation: ANAT
has correlation: DISO
has correlation: GENE
has correlation: PHYS
has correlation: PHEN
has correlation: PROC
has correlation: OBJC
has correlation: DEVI
has correlation: CONC
has correlation: CHEM
definition: MSH: Organic compounds that generally contain an amino (-NH2) and a carboxyl (-COOH) group. Twenty alpha-amino acids are the subunits which are polymerized to form proteins.,CSP: organic acid containing one or more amino groups, especially any of a group that make up proteins and are important to living cells; those that are nonessential can be synthesized by the body while essential acids must be obtained through the diet; there are also several important amino acids, such as the neurotransmitter g-aminobutyric acid, that have no relation to proteins.,NCI: One of several molecules that join together to form proteins. There are 20 common amino acids found in proteins.,NCI: Any organic compounds containing amino (-NH2) and carboxyl (-COOH) groups. In biochemistry, used to refer to the twenty-plus L-alpha-amino acids found in proteins.
in scheme: umls
broader: http://linkedlifedata.com/resource/umls/id/C0002526
broader: http://linkedlifedata.com/resource/umls/id/C0682849
narrower: http://linkedlifedata.com/resource/umls/id/C0002521
narrower: http://linkedlifedata.com/resource/umls/id/C0002522
narrower: http://linkedlifedata.com/resource/umls/id/C0002523
narrower: http://linkedlifedata.com/resource/umls/id/C0002524
narrower: http://linkedlifedata.com/resource/umls/id/C0002527
narrower: http://linkedlifedata.com/resource/umls/id/C0007258
narrower: http://linkedlifedata.com/resource/umls/id/C0008864
narrower: http://linkedlifedata.com/resource/umls/id/C0010286
narrower: http://linkedlifedata.com/resource/umls/id/C0013023
narrower: http://linkedlifedata.com/resource/umls/id/C0031721
narrower: http://linkedlifedata.com/resource/umls/id/C0031724
narrower: http://linkedlifedata.com/resource/umls/id/C0039840
narrower: http://linkedlifedata.com/resource/umls/id/C0243046
narrower: http://linkedlifedata.com/resource/umls/id/C0178474
narrower: http://linkedlifedata.com/resource/umls/id/C0057455
narrower: http://linkedlifedata.com/resource/umls/id/C0072690
narrower: http://linkedlifedata.com/resource/umls/id/C0049919
narrower: http://linkedlifedata.com/resource/umls/id/C2931948
narrower: http://linkedlifedata.com/resource/umls/id/C0077319
narrower: http://linkedlifedata.com/resource/umls/id/C0086332
narrower: http://linkedlifedata.com/resource/umls/id/C0596740
narrower: http://linkedlifedata.com/resource/umls/id/C0682967
narrower: http://linkedlifedata.com/resource/umls/id/C0045854
narrower: http://linkedlifedata.com/resource/umls/id/C0048004
narrower: http://linkedlifedata.com/resource/umls/id/C0048015
narrower: http://linkedlifedata.com/resource/umls/id/C0051529
narrower: http://linkedlifedata.com/resource/umls/id/C0051600
narrower: http://linkedlifedata.com/resource/umls/id/C0051643
narrower: http://linkedlifedata.com/resource/umls/id/C0051664
narrower: http://linkedlifedata.com/resource/umls/id/C0051748
narrower: http://linkedlifedata.com/resource/umls/id/C0052136
narrower: http://linkedlifedata.com/resource/umls/id/C0054842
narrower: http://linkedlifedata.com/resource/umls/id/C0055108
narrower: http://linkedlifedata.com/resource/umls/id/C0056474
narrower: http://linkedlifedata.com/resource/umls/id/C0056583
narrower: http://linkedlifedata.com/resource/umls/id/C0061409
narrower: http://linkedlifedata.com/resource/umls/id/C0067257
narrower: http://linkedlifedata.com/resource/umls/id/C0069056
narrower: http://linkedlifedata.com/resource/umls/id/C0070512
narrower: http://linkedlifedata.com/resource/umls/id/C0071291
narrower: http://linkedlifedata.com/resource/umls/id/C0072819
narrower: http://linkedlifedata.com/resource/umls/id/C0073918
narrower: http://linkedlifedata.com/resource/umls/id/C0074419
narrower: http://linkedlifedata.com/resource/umls/id/C0074908
narrower: http://linkedlifedata.com/resource/umls/id/C0075072
narrower: http://linkedlifedata.com/resource/umls/id/C0075191
narrower: http://linkedlifedata.com/resource/umls/id/C0075421
narrower: http://linkedlifedata.com/resource/umls/id/C0076847
narrower: http://linkedlifedata.com/resource/umls/id/C0077385
narrower: http://linkedlifedata.com/resource/umls/id/C0081070
narrower: http://linkedlifedata.com/resource/umls/id/C0082640
narrower: http://linkedlifedata.com/resource/umls/id/C0103678
narrower: http://linkedlifedata.com/resource/umls/id/C0125603
narrower: http://linkedlifedata.com/resource/umls/id/C0164766
narrower: http://linkedlifedata.com/resource/umls/id/C0165209
narrower: http://linkedlifedata.com/resource/umls/id/C0169883
narrower: http://linkedlifedata.com/resource/umls/id/C0171116
narrower: http://linkedlifedata.com/resource/umls/id/C0171117
narrower: http://linkedlifedata.com/resource/umls/id/C0171118
narrower: http://linkedlifedata.com/resource/umls/id/C0178840
narrower: http://linkedlifedata.com/resource/umls/id/C0207157
narrower: http://linkedlifedata.com/resource/umls/id/C0220780