http://linkedlifedata.com/resource/umls/id/C0001655
type: T116
type: T121
type: T124
type: T125
type: Concept
has correlation: ANAT
has correlation: DISO
has correlation: GENE
has correlation: PHYS
has correlation: PHEN
has correlation: PROC
has correlation: CONC
has correlation: CHEM
definition: CSP: pituitary hormone that stimulates the secretion of adrenal cortical steroids and induces growth of the adrenal cortex.,MSH: An anterior pituitary hormone that stimulates the ADRENAL CORTEX and its production of CORTICOSTEROIDS. ACTH is a 39-amino acid polypeptide of which the N-terminal 24-amino acid segment is identical in all species and contains the adrenocorticotrophic activity. Upon further tissue-specific processing, ACTH can yield ALPHA-MSH and corticotrophin-like intermediate lobe peptide (CLIP).,NCI: A hormone made in the pituitary gland. ACTH acts on the outer part of the adrenal gland to control its release of corticosteroid hormones. More ACTH is made during times of stress.,NCI: A hormone secreted by the anterior portion of the pituitary gland and regulates hormone, primarily cortisol, secreted by the adrenal gland.
in scheme: umls
broader: http://linkedlifedata.com/resource/umls/id/C0019932
broader: http://linkedlifedata.com/resource/umls/id/C0032015
broader: http://linkedlifedata.com/resource/umls/id/C0032016
broader: http://linkedlifedata.com/resource/umls/id/C0027895
broader: http://linkedlifedata.com/resource/umls/id/C0815047
broader: http://linkedlifedata.com/resource/umls/id/C0312439
broader: http://linkedlifedata.com/resource/umls/id/C0682808
narrower: http://linkedlifedata.com/resource/umls/id/C0058901
narrower: http://linkedlifedata.com/resource/umls/id/C0048744
narrower: http://linkedlifedata.com/resource/umls/id/C0050437
narrower: http://linkedlifedata.com/resource/umls/id/C0050599
narrower: http://linkedlifedata.com/resource/umls/id/C0050601
narrower: http://linkedlifedata.com/resource/umls/id/C0050602
narrower: http://linkedlifedata.com/resource/umls/id/C0050605
narrower: http://linkedlifedata.com/resource/umls/id/C0050606
narrower: http://linkedlifedata.com/resource/umls/id/C0050607
narrower: http://linkedlifedata.com/resource/umls/id/C0050608
narrower: http://linkedlifedata.com/resource/umls/id/C0050610
narrower: http://linkedlifedata.com/resource/umls/id/C0050611
narrower: http://linkedlifedata.com/resource/umls/id/C0050612
narrower: http://linkedlifedata.com/resource/umls/id/C0050613
narrower: http://linkedlifedata.com/resource/umls/id/C0050614
narrower: http://linkedlifedata.com/resource/umls/id/C0050615
narrower: http://linkedlifedata.com/resource/umls/id/C0050616
narrower: http://linkedlifedata.com/resource/umls/id/C0050617
narrower: http://linkedlifedata.com/resource/umls/id/C0050619
narrower: http://linkedlifedata.com/resource/umls/id/C0050620
narrower: http://linkedlifedata.com/resource/umls/id/C0050621
narrower: http://linkedlifedata.com/resource/umls/id/C0050623
narrower: http://linkedlifedata.com/resource/umls/id/C0050624
narrower: http://linkedlifedata.com/resource/umls/id/C0050625
narrower: http://linkedlifedata.com/resource/umls/id/C0050626
narrower: http://linkedlifedata.com/resource/umls/id/C0050627
narrower: http://linkedlifedata.com/resource/umls/id/C0050628
narrower: http://linkedlifedata.com/resource/umls/id/C0050629
narrower: http://linkedlifedata.com/resource/umls/id/C0050630
narrower: http://linkedlifedata.com/resource/umls/id/C0053403
narrower: http://linkedlifedata.com/resource/umls/id/C0069614
narrower: http://linkedlifedata.com/resource/umls/id/C0169430
narrower: http://linkedlifedata.com/resource/umls/id/C0244229
narrower: http://linkedlifedata.com/resource/umls/id/C0244543
narrower: http://linkedlifedata.com/resource/umls/id/C0244643
narrower: http://linkedlifedata.com/resource/umls/id/C0252753
narrower: http://linkedlifedata.com/resource/umls/id/C0252759
narrower: http://linkedlifedata.com/resource/umls/id/C0308222
narrower: http://linkedlifedata.com/resource/umls/id/C0602659
narrower: http://linkedlifedata.com/resource/umls/id/C0602726
narrower: http://linkedlifedata.com/resource/umls/id/C0607113
narrower: http://linkedlifedata.com/resource/umls/id/C0610704
narrower: http://linkedlifedata.com/resource/umls/id/C0611135
narrower: http://linkedlifedata.com/resource/umls/id/C0612720
narrower: http://linkedlifedata.com/resource/umls/id/C0614956
narrower: http://linkedlifedata.com/resource/umls/id/C0614960
narrower: http://linkedlifedata.com/resource/umls/id/C0615868
narrower: http://linkedlifedata.com/resource/umls/id/C0616225
narrower: http://linkedlifedata.com/resource/umls/id/C0616954
narrower: http://linkedlifedata.com/resource/umls/id/C0617415
narrower: http://linkedlifedata.com/resource/umls/id/C0618205
narrower: http://linkedlifedata.com/resource/umls/id/C0619584
narrower: http://linkedlifedata.com/resource/umls/id/C0622317
narrower: http://linkedlifedata.com/resource/umls/id/C0627132
narrower: http://linkedlifedata.com/resource/umls/id/C0627494
narrower: http://linkedlifedata.com/resource/umls/id/C0630179
narrower: http://linkedlifedata.com/resource/umls/id/C0631767
narrower: http://linkedlifedata.com/resource/umls/id/C0644224