http://linkedlifedata.com/resource/umls/id/C0000768
type: T019
type: Concept
has correlation: LIVB
has correlation: ANAT
has correlation: DISO
has correlation: PHEN
has correlation: PROC
has correlation: OBJC
has correlation: CONC
has correlation: ORGA
definition: MSH: Malformations of organs or body parts during development in utero.,MEDLINEPLUS: A birth defect is a problem that happens while a baby is developing in the mother's body. Most birth defects happen during the first 3 months of pregnancy. One out of every 33 babies in the United States is born with a birth defect. A birth defect may affect how the body looks, works or both. Some birth defects like cleft lip or neural tube defects are structural problems that can be easy to see. To find others, like heart defects, doctors use special tests. Birth defects can vary from mild to severe. Some result from exposures to medicines or chemicals. For example, alcohol abuse can cause fetal alcohol syndrome. <a href='htt
in scheme: umls
narrower: http://linkedlifedata.com/resource/umls/id/C0265740
narrower: http://linkedlifedata.com/resource/umls/id/C1876203
narrower: http://linkedlifedata.com/resource/umls/id/C0344490
narrower: http://linkedlifedata.com/resource/umls/id/C0266268
narrower: http://linkedlifedata.com/resource/umls/id/C0702139
narrower: http://linkedlifedata.com/resource/umls/id/C1840311
narrower: http://linkedlifedata.com/resource/umls/id/C0152438
narrower: http://linkedlifedata.com/resource/umls/id/C1609433
narrower: http://linkedlifedata.com/resource/umls/id/C0814158
narrower: http://linkedlifedata.com/resource/umls/id/C0497552
narrower: http://linkedlifedata.com/resource/umls/id/C0431637
narrower: http://linkedlifedata.com/resource/umls/id/C0679378
narrower: http://linkedlifedata.com/resource/umls/id/C0679376
narrower: http://linkedlifedata.com/resource/umls/id/C0679377
relation: R28409111
relation: R64585721
relation: R70973683
relation: R28414016
relation: R28487374
relation: R28487375
relation: R28487376
relation: R70958673
relation: R70959899
relation: R70950850
relation: R64572073
relation: R28418320
relation: R70967739
relation: R28418332
relation: R64605954
relation: R28492426
relation: R00940327
relation: R00941296
relation: R12428636
relation: R04595474
relation: R00949457
relation: R04606719
relation: R12451253
relation: R12451197
relation: R12451203
relation: R12451204
relation: R12451299
relation: R12451205
relation: R12451206
relation: R12451207
relation: R12451210
relation: R12451211
relation: R12451214
relation: R12451215
relation: R12451239
relation: R12451216
relation: R12451217
relation: R12451213
relation: R12451246
relation: R12451218
relation: R12451237
relation: R12451258
relation: R12451269
relation: R12451222
relation: R12451223
relation: R12451228
relation: R12451229
relation: R12451265
relation: R12451231
relation: R12451301
relation: R12451220
relation: R12451233
relation: R12451250
relation: R12451251