SmallMoleculeReference
type: Class
comment: A small molecule reference is a grouping of several small molecule entities that have the same chemical structure. Members can differ in celular location and bound partners. Covalent modifications of small molecules are not considered as state changes but treated as different molecules.
disjoint with: DnaRegionReference
disjoint with: RnaRegionReference
disjoint with: DnaReference
disjoint with: ProteinReference
disjoint with: RnaReference
subclass of: EntityReference