CONTROLLED
type: ObjectProperty
comment: The entity that is controlled, e.g., in a biochemical reaction, the reaction is controlled by an enzyme. CONTROLLED is a sub-property of PARTICIPANTS.
sub property of: PARTICIPANTS
domain: control