http://linkedlifedata.com/resource/umls/id/C0302583
type: T121
type: T123
type: T196
type: Concept
has correlation: ANAT
has correlation: DISO
has correlation: PHYS
has correlation: PHEN
has correlation: PROC
has correlation: OBJC
has correlation: DEVI
has correlation: CONC
has correlation: CHEM
definition: MSH: A metallic element with atomic symbol Fe, atomic number 26, and atomic weight 55.85. It is an essential constituent of HEMOGLOBINS; CYTOCHROMES; and IRON-BINDING PROTEINS. It plays a role in cellular redox reactions and in the transport of OXYGEN.,CSP: metallic element found in certain minerals, in nearly all soils, and in mineral waters; atomic symbol Fe, atomic number 26, and atomic weight 55.85; it is an essential constituent of hemoglobin, cytochrome, and other components of respiratory enzyme systems; chief function is in the transport of oxygen to tissue (hemoglobin) and in cellular oxidation mechanisms.,MEDLINEPLUS: Iron is a mineral that our bodies need for many functions. The body needs iron to make the proteins hemoglobin and myoglobin. Hemoglobin is found in red blood cells and myoglobin is found in muscles. They help carry and store oxygen in the body. Iron is also part of many other proteins and enzymes in the body. Your body needs the right amount of iron. If you have too little ir
in scheme: umls
broader: http://linkedlifedata.com/resource/umls/id/C0040577
broader: http://linkedlifedata.com/resource/umls/id/C0347988
broader: http://linkedlifedata.com/resource/umls/id/C0682907
narrower: http://linkedlifedata.com/resource/umls/id/C0773177
narrower: http://linkedlifedata.com/resource/umls/id/C0117541
narrower: http://linkedlifedata.com/resource/umls/id/C0060271
narrower: http://linkedlifedata.com/resource/umls/id/C0055131
narrower: http://linkedlifedata.com/resource/umls/id/C0604742
narrower: http://linkedlifedata.com/resource/umls/id/C0644690
narrower: http://linkedlifedata.com/resource/umls/id/C0212019
narrower: http://linkedlifedata.com/resource/umls/id/C0060222
narrower: http://linkedlifedata.com/resource/umls/id/C0082568
narrower: http://linkedlifedata.com/resource/umls/id/C0601194
narrower: http://linkedlifedata.com/resource/umls/id/C0612114
narrower: http://linkedlifedata.com/resource/umls/id/C0612471
narrower: http://linkedlifedata.com/resource/umls/id/C0616339
narrower: http://linkedlifedata.com/resource/umls/id/C0640302
narrower: http://linkedlifedata.com/resource/umls/id/C0643348
narrower: http://linkedlifedata.com/resource/umls/id/C0668496
relation: R50924332
relation: R01361546
relation: R55154394
relation: R112875430
relation: R120338942
relation: R120338943
relation: R120338946
relation: R120338947
relation: R120338948
relation: R120338950
relation: R120338951
relation: R120338952
relation: R120338954
relation: R120338955
relation: R120338956
relation: R120338958
relation: R120338959
relation: R120338960
relation: R120338961
relation: R120338962
relation: R120338963
relation: R120338964
relation: R120338965
relation: R120338966
relation: R120338967
relation: R120338968
relation: R120338953
relation: R120338944
relation: R120338957
relation: R120338949
relation: R71208254
relation: R71313785
relation: R44717286
relation: R128851696
relation: R128851708
relation: R128851700
relation: R128851701
relation: R128851699
relation: R128851698
relation: R128851702
relation: R128851712
relation: R128851709
relation: R128851716
relation: R128851706
relation: R128851717
relation: R128851718