http://linkedlifedata.com/resource/umls/id/C0175677
type: T037
type: Concept
has correlation: LIVB
has correlation: ANAT
has correlation: DISO
has correlation: PHEN
has correlation: ACTI
has correlation: PROC
has correlation: OBJC
has correlation: CONC
has correlation: OCCU
has correlation: ORGA
has correlation: CHEM
definition: CSP: damage inflicted on the body as the direct or indirect result of an external force, with or without disruption of structural continuity.,MEDLINEPLUS: An injury is damage to your body. It is a general term that refers to harm caused by accidents, falls, blows, burns, weapons and more. In the U.S., millions of people injure themselves every year. These injuries range from minor to life-threatening. Injuries can happen at work or play, indoors or outdoors, driving a car or walking across the street. Common injuries include Burns Dislocations Fractures <a href='http://www.n
in scheme: umls
broader: http://linkedlifedata.com/resource/umls/id/C0043251
narrower: http://linkedlifedata.com/resource/umls/id/C0004601
narrower: http://linkedlifedata.com/resource/umls/id/C0043251
narrower: http://linkedlifedata.com/resource/umls/id/C0037929
narrower: http://linkedlifedata.com/resource/umls/id/C0004161
narrower: http://linkedlifedata.com/resource/umls/id/C0015408
narrower: http://linkedlifedata.com/resource/umls/id/C0043250
narrower: http://linkedlifedata.com/resource/umls/id/C0039980
narrower: http://linkedlifedata.com/resource/umls/id/C0281865
narrower: http://linkedlifedata.com/resource/umls/id/C0273115
narrower: http://linkedlifedata.com/resource/umls/id/C0009938
narrower: http://linkedlifedata.com/resource/umls/id/C0004760
narrower: http://linkedlifedata.com/resource/umls/id/C0005604
narrower: http://linkedlifedata.com/resource/umls/id/C0161479
narrower: http://linkedlifedata.com/resource/umls/id/C0560570
narrower: http://linkedlifedata.com/resource/umls/id/C0449499
narrower: http://linkedlifedata.com/resource/umls/id/C0178671
narrower: http://linkedlifedata.com/resource/umls/id/C0272448
narrower: http://linkedlifedata.com/resource/umls/id/C0332685
narrower: http://linkedlifedata.com/resource/umls/id/C0743668
narrower: http://linkedlifedata.com/resource/umls/id/C1306570
narrower: http://linkedlifedata.com/resource/umls/id/C0813962
relation: R41124444
relation: R00943577
relation: R05204477
relation: R05204478
relation: R05204476
relation: R05218800
relation: R00692117
relation: R00709744
relation: R00709748
relation: R00709749
relation: R00709747
relation: R00709745
relation: R00709746
relation: R00726673
relation: R00726674
relation: R00726675
relation: R00737469
relation: R05240460
relation: R05662705
relation: R05662712
relation: R05662704
relation: R05662706
relation: R05662708
relation: R05662709
relation: R05662720
relation: R05662707
relation: R05662711
relation: R05662710
relation: R05662721
relation: R05662722
relation: R05662719
relation: R44003483
relation: R05662717
relation: R05662715
relation: R05662714
relation: R05662723
relation: R05662716
relation: R05662713
relation: R05672950
relation: R00893929
relation: R00906079
relation: R00906086
relation: R00906078