http://linkedlifedata.com/resource/umls/id/C0038454
type: T047
type: Concept
has correlation: LIVB
has correlation: ANAT
has correlation: DISO
has correlation: GENE
has correlation: PHYS
has correlation: PHEN
has correlation: ACTI
has correlation: PROC
has correlation: OBJC
has correlation: DEVI
has correlation: CONC
has correlation: OCCU
has correlation: ORGA
has correlation: CHEM
definition: CSP: sudden neurologic impairment due to a cerebrovascular disorder, either an arterial occlusion or an intracranial hemorrhage.,MSH: A group of pathological conditions characterized by sudden, non-convulsive loss of neurological function due to BRAIN ISCHEMIA or INTRACRANIAL HEMORRHAGES. Stroke is classified by the type of tissue NECROSIS, such as the anatomic location, vasculature involved, etiology, age of the affected individual, and hemorrhagic vs. non-hemorrhagic nature. (From Adams et al., Principles of Neurology, 6th ed, pp777-810),MEDLINEPLUS: A stroke is a medical emergency. Strokes happen when blood flow to your brain stops. Within minutes, brain cells begin to die. There are two kinds of stroke. The more common kind, called ischemic stroke, is caused by a blood clot that blocks or plugs a blood vessel in the brain. The other kind, called hemorrhagic stroke, is caused by a blood vessel that breaks and bleeds into the brain. "Mini-strokes" or <a href='http://www.nlm.nih.gov/medlineplus/
in scheme: umls
broader: http://linkedlifedata.com/resource/umls/id/C0042373
narrower: http://linkedlifedata.com/resource/umls/id/C0751956
narrower: http://linkedlifedata.com/resource/umls/id/C0679443
relation: R03689404
relation: R00940308
relation: R70970854
relation: R00941609
relation: R00941836
relation: R05777515
relation: R05777516
relation: R05777517
relation: R05777518
relation: R05777519
relation: R05777520
relation: R00950179
relation: R00950180
relation: R00950181
relation: R70970853
relation: R00944958
relation: R04599351
relation: R05205110
relation: R05219592
relation: R00693305
relation: R00710621
relation: R00727489
relation: R00737876
relation: R05243785
relation: R05243786
relation: R05243784
relation: R00747255
relation: R00747256
relation: R05674858
relation: R00895836
relation: R43979274
relation: R43988618
relation: R43988619
relation: R43988620
relation: R43988621
relation: R05735008
relation: R05735007
relation: R05735005
relation: R05735006
relation: R06495180
relation: R06495181
relation: R00747498
relation: R00747499
relation: R43994699
relation: R43994819
relation: R131871716
relation: R60486413
relation: R69598396
relation: R60487831
relation: R69595451
relation: R125081404
relation: R60573852
relation: R69591525
relation: R60489009
relation: R60519012
relation: R132873932
relation: R70972149
relation: R32163608
relation: R120600381