http://linkedlifedata.com/resource/umls/id/C0038317
type: T110
type: Concept
has correlation: LIVB
has correlation: ANAT
has correlation: DISO
has correlation: PHYS
has correlation: PHEN
has correlation: ACTI
has correlation: PROC
has correlation: CONC
has correlation: CHEM
definition: MSH: A group of polycyclic compounds closely related biochemically to TERPENES. They include cholesterol, numerous hormones, precursors of certain vitamins, bile acids, alcohols (STEROLS), and certain natural drugs and poisons. Steroids have a common nucleus, a fused, reduced 17-carbon atom ring system, cyclopentanoperhydrophenanthrene. Most steroids also have two methyl groups and an aliphatic side-chain attached to the nucleus. (From Hawley's Condensed Chemical Dictionary, 11th ed),CSP: compounds that contain a hydrogenated cyclopentanoperhydrophenanthrene ring system; they include cholesterol, numerous hormones, precursors of certain vitamins, bile acids, alcohols, and certain natural drugs and poisons.,NCI: Any of a group of lipids (fats) that have a certain chemical structure. Steroids occur naturally in plants and animals or they may be made in the laboratory. Examples of steroids include sex hormones, cholesterol, bile acids, and some drugs.,MEDLINEPLUS: You may have heard about <a href='http://www.
in scheme: umls
narrower: http://linkedlifedata.com/resource/umls/id/C0002744
narrower: http://linkedlifedata.com/resource/umls/id/C0002854
narrower: http://linkedlifedata.com/resource/umls/id/C0007142
narrower: http://linkedlifedata.com/resource/umls/id/C0008306
narrower: http://linkedlifedata.com/resource/umls/id/C0008366
narrower: http://linkedlifedata.com/resource/umls/id/C0014924
narrower: http://linkedlifedata.com/resource/umls/id/C0033006
narrower: http://linkedlifedata.com/resource/umls/id/C0038321
narrower: http://linkedlifedata.com/resource/umls/id/C0301818
narrower: http://linkedlifedata.com/resource/umls/id/C0250263
narrower: http://linkedlifedata.com/resource/umls/id/C0084051
narrower: http://linkedlifedata.com/resource/umls/id/C0290613
narrower: http://linkedlifedata.com/resource/umls/id/C0290615
narrower: http://linkedlifedata.com/resource/umls/id/C0642787
narrower: http://linkedlifedata.com/resource/umls/id/C0654191
narrower: http://linkedlifedata.com/resource/umls/id/C1097721
narrower: http://linkedlifedata.com/resource/umls/id/C1097722
narrower: http://linkedlifedata.com/resource/umls/id/C1097723
narrower: http://linkedlifedata.com/resource/umls/id/C1099944
narrower: http://linkedlifedata.com/resource/umls/id/C0683001
narrower: http://linkedlifedata.com/resource/umls/id/C0178625
narrower: http://linkedlifedata.com/resource/umls/id/C2003735
narrower: http://linkedlifedata.com/resource/umls/id/C1742968
narrower: http://linkedlifedata.com/resource/umls/id/C2003715
narrower: http://linkedlifedata.com/resource/umls/id/C0178549
narrower: http://linkedlifedata.com/resource/umls/id/C0250655
narrower: http://linkedlifedata.com/resource/umls/id/C0644019
narrower: http://linkedlifedata.com/resource/umls/id/C0644022
narrower: http://linkedlifedata.com/resource/umls/id/C1097851
narrower: http://linkedlifedata.com/resource/umls/id/C0597161
narrower: http://linkedlifedata.com/resource/umls/id/C0597515
narrower: http://linkedlifedata.com/resource/umls/id/C0683000
narrower: http://linkedlifedata.com/resource/umls/id/C0815053
narrower: http://linkedlifedata.com/resource/umls/id/C0815054
narrower: http://linkedlifedata.com/resource/umls/id/C0815055
narrower: http://linkedlifedata.com/resource/umls/id/C1172559
narrower: http://linkedlifedata.com/resource/umls/id/C0682955
narrower: http://linkedlifedata.com/resource/umls/id/C1740197
narrower: http://linkedlifedata.com/resource/umls/id/C2743742
narrower: http://linkedlifedata.com/resource/umls/id/C2353921
narrower: http://linkedlifedata.com/resource/umls/id/C2604688
narrower: http://linkedlifedata.com/resource/umls/id/C1173163
narrower: http://linkedlifedata.com/resource/umls/id/C1173164
narrower: http://linkedlifedata.com/resource/umls/id/C1313032
narrower: http://linkedlifedata.com/resource/umls/id/C1313033
narrower: http://linkedlifedata.com/resource/umls/id/C2003716
narrower: http://linkedlifedata.com/resource/umls/id/C2744007
narrower: http://linkedlifedata.com/resource/umls/id/C0007401
narrower: http://linkedlifedata.com/resource/umls/id/C0250653
narrower: http://linkedlifedata.com/resource/umls/id/C0258370
narrower: http://linkedlifedata.com/resource/umls/id/C0258373
narrower: http://linkedlifedata.com/resource/umls/id/C0387113
narrower: http://linkedlifedata.com/resource/umls/id/C0387115
narrower: http://linkedlifedata.com/resource/umls/id/C0533056
narrower: http://linkedlifedata.com/resource/umls/id/C0533058
narrower: http://linkedlifedata.com/resource/umls/id/C0536019
narrower: http://linkedlifedata.com/resource/umls/id/C0645120
narrower: http://linkedlifedata.com/resource/umls/id/C0649204
narrower: http://linkedlifedata.com/resource/umls/id/C0654895
narrower: http://linkedlifedata.com/resource/umls/id/C0658348
narrower: http://linkedlifedata.com/resource/umls/id/C0658350
narrower: http://linkedlifedata.com/resource/umls/id/C0660545
narrower: http://linkedlifedata.com/resource/umls/id/C0660547
narrower: http://linkedlifedata.com/resource/umls/id/C0755451
narrower: http://linkedlifedata.com/resource/umls/id/C0759156
narrower: http://linkedlifedata.com/resource/umls/id/C0761167
narrower: http://linkedlifedata.com/resource/umls/id/C0761168