http://linkedlifedata.com/resource/umls/id/C0032521
type: T104
type: T122
type: Concept
has correlation: PHYS
has correlation: PHEN
has correlation: PROC
has correlation: OBJC
has correlation: DEVI
has correlation: CONC
has correlation: CHEM
definition: MSH: Compounds formed by the joining of smaller, usually repeating, units linked by covalent bonds. These compounds often form large macromolecules (e.g., BIOPOLYMERS; PLASTICS).,CSP: compounds formed by the joining of smaller, usually repeating, units linked by covalent bonds; these compounds often form large macromolecules; for example, plastics, polypeptides, polysaccharides, and nucleic acids.,NCI: A molecule made up of a linked series of repeated monomers.,NCI: A molecule made up of small identical molecules called monomers. The monomers are joined together in a repeating pattern.
in scheme: umls
narrower: http://linkedlifedata.com/resource/umls/id/C0013766
narrower: http://linkedlifedata.com/resource/umls/id/C0070066
narrower: http://linkedlifedata.com/resource/umls/id/C0440257
narrower: http://linkedlifedata.com/resource/umls/id/C0070573
narrower: http://linkedlifedata.com/resource/umls/id/C0074937
narrower: http://linkedlifedata.com/resource/umls/id/C0287409
narrower: http://linkedlifedata.com/resource/umls/id/C0287410
narrower: http://linkedlifedata.com/resource/umls/id/C0287411
narrower: http://linkedlifedata.com/resource/umls/id/C0071556
narrower: http://linkedlifedata.com/resource/umls/id/C0071688
narrower: http://linkedlifedata.com/resource/umls/id/C0054708
narrower: http://linkedlifedata.com/resource/umls/id/C0071443
narrower: http://linkedlifedata.com/resource/umls/id/C0069175
narrower: http://linkedlifedata.com/resource/umls/id/C0070131
narrower: http://linkedlifedata.com/resource/umls/id/C0071496
narrower: http://linkedlifedata.com/resource/umls/id/C0050590
narrower: http://linkedlifedata.com/resource/umls/id/C0960864
narrower: http://linkedlifedata.com/resource/umls/id/C1613333
narrower: http://linkedlifedata.com/resource/umls/id/C0624100
narrower: http://linkedlifedata.com/resource/umls/id/C2717536
narrower: http://linkedlifedata.com/resource/umls/id/C0596383
narrower: http://linkedlifedata.com/resource/umls/id/C0596448
narrower: http://linkedlifedata.com/resource/umls/id/C1570120
narrower: http://linkedlifedata.com/resource/umls/id/C0137740
narrower: http://linkedlifedata.com/resource/umls/id/C0172492
narrower: http://linkedlifedata.com/resource/umls/id/C2352090
narrower: http://linkedlifedata.com/resource/umls/id/C0638697
narrower: http://linkedlifedata.com/resource/umls/id/C0056429
narrower: http://linkedlifedata.com/resource/umls/id/C0081480
narrower: http://linkedlifedata.com/resource/umls/id/C0167721
narrower: http://linkedlifedata.com/resource/umls/id/C0379223
narrower: http://linkedlifedata.com/resource/umls/id/C0602011
narrower: http://linkedlifedata.com/resource/umls/id/C0607229
narrower: http://linkedlifedata.com/resource/umls/id/C0625631
narrower: http://linkedlifedata.com/resource/umls/id/C0628689
narrower: http://linkedlifedata.com/resource/umls/id/C0655468
narrower: http://linkedlifedata.com/resource/umls/id/C0658710
narrower: http://linkedlifedata.com/resource/umls/id/C0910434
narrower: http://linkedlifedata.com/resource/umls/id/C0913742
narrower: http://linkedlifedata.com/resource/umls/id/C0964960
narrower: http://linkedlifedata.com/resource/umls/id/C1120852
narrower: http://linkedlifedata.com/resource/umls/id/C1702144
narrower: http://linkedlifedata.com/resource/umls/id/C2976088
narrower: http://linkedlifedata.com/resource/umls/id/C3180827
relation: R28512564
relation: R120417866
relation: R120417867
relation: R120417869
relation: R120417870
relation: R120417871
relation: R120417872
relation: R120417873
relation: R120417874
relation: R120417875
relation: R120417876
relation: R120417878
relation: R120417879
relation: R120417880
relation: R120417881
relation: R120417882
relation: R120417883
relation: R120417884
relation: R120417885
relation: R120417868
relation: R120417877
relation: R71064181
relation: R71063701
relation: R71170010