http://linkedlifedata.com/resource/umls/id/C0023820
type: T116
type: T123
type: Concept
has correlation: ANAT
has correlation: DISO
has correlation: GENE
has correlation: PHYS
has correlation: PHEN
has correlation: PROC
has correlation: OBJC
has correlation: CONC
has correlation: CHEM
definition: MSH: Lipid-protein complexes involved in the transportation and metabolism of lipids in the body. They are spherical particles consisting of a hydrophobic core of TRIGLYCERIDES and CHOLESTEROL ESTERS surrounded by a layer of hydrophilic free CHOLESTEROL; PHOSPHOLIPIDS; and APOLIPOPROTEINS. Lipoproteins are classified by their varying buoyant density and sizes.,NCI: An important class of serum proteins in which a spherical hydrophobic core of triglycerides or cholesterol esters surrounded by an amphipathic monolayer of phospholipids, cholesterol and apolipoproteins. Classified according to density: chylomicrons, large low density particles, very low density, low density and high density species. Important in lipid transport, especially cholesterol transport in the blood stream. Abnormalities in lipoprotein metabolism have been implicated in certain heart diseases. (On-line Medical Dictionary)
in scheme: umls
broader: http://linkedlifedata.com/resource/umls/id/C0815049
narrower: http://linkedlifedata.com/resource/umls/id/C0023821
narrower: http://linkedlifedata.com/resource/umls/id/C0023823
narrower: http://linkedlifedata.com/resource/umls/id/C0023825
narrower: http://linkedlifedata.com/resource/umls/id/C0025544
narrower: http://linkedlifedata.com/resource/umls/id/C0676798
narrower: http://linkedlifedata.com/resource/umls/id/C1384653
narrower: http://linkedlifedata.com/resource/umls/id/C0065061
narrower: http://linkedlifedata.com/resource/umls/id/C0971221
narrower: http://linkedlifedata.com/resource/umls/id/C0065050
narrower: http://linkedlifedata.com/resource/umls/id/C0083852
narrower: http://linkedlifedata.com/resource/umls/id/C0134235
narrower: http://linkedlifedata.com/resource/umls/id/C0163682
narrower: http://linkedlifedata.com/resource/umls/id/C0250221
narrower: http://linkedlifedata.com/resource/umls/id/C0256453
narrower: http://linkedlifedata.com/resource/umls/id/C0381235
narrower: http://linkedlifedata.com/resource/umls/id/C0385064
narrower: http://linkedlifedata.com/resource/umls/id/C0390598
narrower: http://linkedlifedata.com/resource/umls/id/C0528824
narrower: http://linkedlifedata.com/resource/umls/id/C0534672
narrower: http://linkedlifedata.com/resource/umls/id/C0534941
narrower: http://linkedlifedata.com/resource/umls/id/C0649302
narrower: http://linkedlifedata.com/resource/umls/id/C0655835
narrower: http://linkedlifedata.com/resource/umls/id/C0655837
narrower: http://linkedlifedata.com/resource/umls/id/C0656248
narrower: http://linkedlifedata.com/resource/umls/id/C0660895
narrower: http://linkedlifedata.com/resource/umls/id/C0908278
narrower: http://linkedlifedata.com/resource/umls/id/C0967128
narrower: http://linkedlifedata.com/resource/umls/id/C1307243
narrower: http://linkedlifedata.com/resource/umls/id/C1307687
narrower: http://linkedlifedata.com/resource/umls/id/C1307688
narrower: http://linkedlifedata.com/resource/umls/id/C1308710
narrower: http://linkedlifedata.com/resource/umls/id/C1308837
narrower: http://linkedlifedata.com/resource/umls/id/C1309688
narrower: http://linkedlifedata.com/resource/umls/id/C1310286
narrower: http://linkedlifedata.com/resource/umls/id/C1429796
narrower: http://linkedlifedata.com/resource/umls/id/C1430411
narrower: http://linkedlifedata.com/resource/umls/id/C1432232
narrower: http://linkedlifedata.com/resource/umls/id/C1432388
narrower: http://linkedlifedata.com/resource/umls/id/C1437367
narrower: http://linkedlifedata.com/resource/umls/id/C1438894
narrower: http://linkedlifedata.com/resource/umls/id/C1448889
narrower: http://linkedlifedata.com/resource/umls/id/C1448915
narrower: http://linkedlifedata.com/resource/umls/id/C1449248
narrower: http://linkedlifedata.com/resource/umls/id/C1571569
narrower: http://linkedlifedata.com/resource/umls/id/C2745639
narrower: http://linkedlifedata.com/resource/umls/id/C0069440
narrower: http://linkedlifedata.com/resource/umls/id/C0133829
narrower: http://linkedlifedata.com/resource/umls/id/C0138826
narrower: http://linkedlifedata.com/resource/umls/id/C0148556
narrower: http://linkedlifedata.com/resource/umls/id/C0289114
narrower: http://linkedlifedata.com/resource/umls/id/C0300317
narrower: http://linkedlifedata.com/resource/umls/id/C0300589
narrower: http://linkedlifedata.com/resource/umls/id/C0384690
narrower: http://linkedlifedata.com/resource/umls/id/C0529442
narrower: http://linkedlifedata.com/resource/umls/id/C0535077
narrower: http://linkedlifedata.com/resource/umls/id/C0648918
narrower: http://linkedlifedata.com/resource/umls/id/C0648921
narrower: http://linkedlifedata.com/resource/umls/id/C0655839
narrower: http://linkedlifedata.com/resource/umls/id/C0658031
narrower: http://linkedlifedata.com/resource/umls/id/C0764886
narrower: http://linkedlifedata.com/resource/umls/id/C0913283
narrower: http://linkedlifedata.com/resource/umls/id/C0914282
narrower: http://linkedlifedata.com/resource/umls/id/C1256850
narrower: http://linkedlifedata.com/resource/umls/id/C1256916
narrower: http://linkedlifedata.com/resource/umls/id/C1261569