http://linkedlifedata.com/resource/umls/id/C0020517
type: T046
type: Concept
has correlation: LIVB
has correlation: ANAT
has correlation: DISO
has correlation: GENE
has correlation: PHYS
has correlation: PHEN
has correlation: PROC
has correlation: OBJC
has correlation: DEVI
has correlation: CONC
has correlation: OCCU
has correlation: ORGA
has correlation: CHEM
definition: MSH: Altered reactivity to an antigen, which can result in pathologic reactions upon subsequent exposure to that particular antigen.,CSP: state of previously immunized body in which tissue damage results from the immune response to a further dose of antigen.,HL7V3.0: Hypersensitivity to an agent caused by an immunologic response to an initial exposure ,NCI: An exaggerated response by the immune system to a drug or other substance.,GO: An inflammatory response to an exogenous environmental antigen or an endogenous antigen initiated by the adaptive immune system. [GOC:jal, ISBN:0781735149],MEDLINEPLUS: An allergy is a reaction of your immune system to something that does not bother most other people. People who have allergies often are sensitive to more than one thing. Substances that often cause reactions are Pollen Dust mites Mold spores Pet dander <a href='http://www.nlm.nih.gov/medlineplus/food
in scheme: umls
narrower: http://linkedlifedata.com/resource/umls/id/C0020523
narrower: http://linkedlifedata.com/resource/umls/id/C0020522
relation: R28411409
relation: R28484262
relation: R28426079
relation: R28500959
relation: R32172580
relation: R120328084
relation: R120328085
relation: R120328086
relation: R120328088
relation: R120328090
relation: R120328091
relation: R120328092
relation: R120328093
relation: R120328094
relation: R120328104
relation: R120328095
relation: R120328096
relation: R120328097
relation: R120328098
relation: R120328100
relation: R120328101
relation: R120328102
relation: R120328103
relation: R120328107
relation: R120328108
relation: R120328110
relation: R120328111
relation: R120328112
relation: R120328113
relation: R120328114
relation: R120328115
relation: R120328116
relation: R120328117
relation: R120328118
relation: R120328119
relation: R120328106
relation: R120328087
relation: R120328099
relation: R120328109
relation: R120328089
relation: R120328105
relation: R71393596
relation: R71335920
relation: R71344635
relation: R71075909
relation: R71181282
relation: R71347872
relation: R71227384
relation: R71048760
relation: R28387949
relation: R28387951
relation: R28387952
relation: R101251860
relation: R123295696
relation: R71395825
relation: R71120201
relation: R70982089
relation: R71010430
relation: R71201704
relation: R70982078
relation: R71091965