http://linkedlifedata.com/resource/umls/id/C0019932
type: T125
type: Concept
has correlation: ANAT
has correlation: DISO
has correlation: GENE
has correlation: PHYS
has correlation: PHEN
has correlation: PROC
has correlation: OBJC
has correlation: CONC
has correlation: OCCU
has correlation: CHEM
definition: MSH: Chemical substances having a specific regulatory effect on the activity of a certain organ or organs. The term was originally applied to substances secreted by various ENDOCRINE GLANDS and transported in the bloodstream to the target organs. It is sometimes extended to include those substances that are not produced by the endocrine glands but that have similar effects.,CSP: chemical substances having a specific regulatory effect on the activity of a certain organ or organs, especially substances secreted by various endocrine glands and transported in the bloodstream to the target organs.,MEDLINEPLUS: Hormones are your body's chemical messengers. They travel in your bloodstream to tissues or organs. They work slowly, over time, and affect many different processes, including Growth and development Metabolism - how your body gets energy from the foods you eat Sexual function Reproduction Mood Endocrine glands, which are special groups of cell
in scheme: umls
narrower: http://linkedlifedata.com/resource/umls/id/C0030298
narrower: http://linkedlifedata.com/resource/umls/id/C0030095
narrower: http://linkedlifedata.com/resource/umls/id/C0033371
narrower: http://linkedlifedata.com/resource/umls/id/C0036534
narrower: http://linkedlifedata.com/resource/umls/id/C0010132
narrower: http://linkedlifedata.com/resource/umls/id/C0033373
narrower: http://linkedlifedata.com/resource/umls/id/C0037659
narrower: http://linkedlifedata.com/resource/umls/id/C0040162
narrower: http://linkedlifedata.com/resource/umls/id/C0733758
narrower: http://linkedlifedata.com/resource/umls/id/C0017687
narrower: http://linkedlifedata.com/resource/umls/id/C0025219
narrower: http://linkedlifedata.com/resource/umls/id/C0001655
narrower: http://linkedlifedata.com/resource/umls/id/C0023607
narrower: http://linkedlifedata.com/resource/umls/id/C0037663
narrower: http://linkedlifedata.com/resource/umls/id/C0040160
narrower: http://linkedlifedata.com/resource/umls/id/C1705480
narrower: http://linkedlifedata.com/resource/umls/id/C0017151
narrower: http://linkedlifedata.com/resource/umls/id/C0040135
narrower: http://linkedlifedata.com/resource/umls/id/C0026667
narrower: http://linkedlifedata.com/resource/umls/id/C0597049
narrower: http://linkedlifedata.com/resource/umls/id/C0002302
narrower: http://linkedlifedata.com/resource/umls/id/C0005261
narrower: http://linkedlifedata.com/resource/umls/id/C0010192
narrower: http://linkedlifedata.com/resource/umls/id/C0017048
narrower: http://linkedlifedata.com/resource/umls/id/C0021946
narrower: http://linkedlifedata.com/resource/umls/id/C0026669
narrower: http://linkedlifedata.com/resource/umls/id/C0037668
narrower: http://linkedlifedata.com/resource/umls/id/C0597192
narrower: http://linkedlifedata.com/resource/umls/id/C0032082
narrower: http://linkedlifedata.com/resource/umls/id/C0597376
narrower: http://linkedlifedata.com/resource/umls/id/C0301818
narrower: http://linkedlifedata.com/resource/umls/id/C0682760
narrower: http://linkedlifedata.com/resource/umls/id/C0682765
relation: R17710769
relation: R17710776
relation: R17710771
relation: R17710777
relation: R17710772
relation: R17710770
relation: R17710773
relation: R17710774
relation: R17710778
relation: R17710775
relation: R17820270
relation: R04362536
relation: R04425116
relation: R04425123
relation: R04425118
relation: R04425124
relation: R04425119
relation: R04425117
relation: R04425120
relation: R04425121
relation: R04425125
relation: R04425122
relation: R12054618
relation: R12054626
relation: R12054633
relation: R12054622
relation: R12054628
relation: R12054621
relation: R12054623
relation: R12054627
relation: R12054620
relation: R12054624
relation: R12054636