http://linkedlifedata.com/resource/umls/id/C0019134
type: T118
type: T121
type: T123
type: Concept
has correlation: ANAT
has correlation: DISO
has correlation: PHYS
has correlation: PHEN
has correlation: PROC
has correlation: DEVI
has correlation: CONC
has correlation: CHEM
definition: MSH: A highly acidic mucopolysaccharide formed of equal parts of sulfated D-glucosamine and D-glucuronic acid with sulfaminic bridges. The molecular weight ranges from six to twenty thousand. Heparin occurs in and is obtained from liver, lung, mast cells, etc., of vertebrates. Its function is unknown, but it is used to prevent blood clotting in vivo and vitro, in the form of many different salts.,CSP: poly(glucosamine sulfate-glucuronic acid); endogenous mucopolysaccharide with antithrombin and lipotropic activities; USP injection is used as an anticoagulant.,SPN: Enzyme preparations are products that are used in the histopathology laboratory for the following purposes: (1) To disaggregate tissues and cells already in established cultures for preparation into subsequent cultures (e.g., trypsin); (2) To disaggregate fluid specimens for cytological examination (e.g., papain for gastric lavage or trypsin for sputum liquefaction); (3) To aid in the selective staining of tissue specimens (e.g., diastase for glycog
in scheme: umls
broader: http://linkedlifedata.com/resource/umls/id/C0017973
broader: http://linkedlifedata.com/resource/umls/id/C0003280
broader: http://linkedlifedata.com/resource/umls/id/C0003440
broader: http://linkedlifedata.com/resource/umls/id/C0016018
broader: http://linkedlifedata.com/resource/umls/id/C0597540
narrower: http://linkedlifedata.com/resource/umls/id/C2930439
narrower: http://linkedlifedata.com/resource/umls/id/C0037513
narrower: http://linkedlifedata.com/resource/umls/id/C0054452
narrower: http://linkedlifedata.com/resource/umls/id/C0982192
narrower: http://linkedlifedata.com/resource/umls/id/C0062508
narrower: http://linkedlifedata.com/resource/umls/id/C0065192
narrower: http://linkedlifedata.com/resource/umls/id/C0071604
narrower: http://linkedlifedata.com/resource/umls/id/C0072317
narrower: http://linkedlifedata.com/resource/umls/id/C0254371
narrower: http://linkedlifedata.com/resource/umls/id/C1137322
narrower: http://linkedlifedata.com/resource/umls/id/C0076831
narrower: http://linkedlifedata.com/resource/umls/id/C0076558
narrower: http://linkedlifedata.com/resource/umls/id/C0077788
narrower: http://linkedlifedata.com/resource/umls/id/C2930462
narrower: http://linkedlifedata.com/resource/umls/id/C0058674
narrower: http://linkedlifedata.com/resource/umls/id/C0059025
narrower: http://linkedlifedata.com/resource/umls/id/C0254356
narrower: http://linkedlifedata.com/resource/umls/id/C0057667
narrower: http://linkedlifedata.com/resource/umls/id/C0058675
narrower: http://linkedlifedata.com/resource/umls/id/C0525202
narrower: http://linkedlifedata.com/resource/umls/id/C0619274
narrower: http://linkedlifedata.com/resource/umls/id/C0057116
narrower: http://linkedlifedata.com/resource/umls/id/C0062510
narrower: http://linkedlifedata.com/resource/umls/id/C0062513
narrower: http://linkedlifedata.com/resource/umls/id/C0062516
narrower: http://linkedlifedata.com/resource/umls/id/C0063272
narrower: http://linkedlifedata.com/resource/umls/id/C0072808
narrower: http://linkedlifedata.com/resource/umls/id/C0075945
narrower: http://linkedlifedata.com/resource/umls/id/C0085776
narrower: http://linkedlifedata.com/resource/umls/id/C0133796
narrower: http://linkedlifedata.com/resource/umls/id/C0134076
narrower: http://linkedlifedata.com/resource/umls/id/C0142237
narrower: http://linkedlifedata.com/resource/umls/id/C0211917
narrower: http://linkedlifedata.com/resource/umls/id/C0217593
narrower: http://linkedlifedata.com/resource/umls/id/C0249580
narrower: http://linkedlifedata.com/resource/umls/id/C0259650
narrower: http://linkedlifedata.com/resource/umls/id/C0295023
narrower: http://linkedlifedata.com/resource/umls/id/C0388197
narrower: http://linkedlifedata.com/resource/umls/id/C0390440
narrower: http://linkedlifedata.com/resource/umls/id/C0539763
narrower: http://linkedlifedata.com/resource/umls/id/C0591804
narrower: http://linkedlifedata.com/resource/umls/id/C0591805
narrower: http://linkedlifedata.com/resource/umls/id/C0592228
narrower: http://linkedlifedata.com/resource/umls/id/C0607824
narrower: http://linkedlifedata.com/resource/umls/id/C0623344
narrower: http://linkedlifedata.com/resource/umls/id/C0624576
narrower: http://linkedlifedata.com/resource/umls/id/C0646663
narrower: http://linkedlifedata.com/resource/umls/id/C0649736
narrower: http://linkedlifedata.com/resource/umls/id/C0656529
narrower: http://linkedlifedata.com/resource/umls/id/C0656531
narrower: http://linkedlifedata.com/resource/umls/id/C0664783
narrower: http://linkedlifedata.com/resource/umls/id/C0672640
narrower: http://linkedlifedata.com/resource/umls/id/C0700892
narrower: http://linkedlifedata.com/resource/umls/id/C0700894
narrower: http://linkedlifedata.com/resource/umls/id/C0720844
narrower: http://linkedlifedata.com/resource/umls/id/C0763690
narrower: http://linkedlifedata.com/resource/umls/id/C0763835
narrower: http://linkedlifedata.com/resource/umls/id/C0915548
narrower: http://linkedlifedata.com/resource/umls/id/C1137991
narrower: http://linkedlifedata.com/resource/umls/id/C1144383
narrower: http://linkedlifedata.com/resource/umls/id/C1263212