http://linkedlifedata.com/resource/umls/id/C0014544
type: T047
type: Concept
has correlation: LIVB
has correlation: ANAT
has correlation: DISO
has correlation: GENE
has correlation: PHYS
has correlation: PHEN
has correlation: PROC
has correlation: OBJC
has correlation: CONC
has correlation: OCCU
has correlation: ORGA
has correlation: CHEM
definition: MSH: A disorder characterized by recurrent episodes of paroxysmal brain dysfunction due to a sudden, disorderly, and excessive neuronal discharge. Epilepsy classification systems are generally based upon: (1) clinical features of the seizure episodes (e.g., motor seizure), (2) etiology (e.g., post-traumatic), (3) anatomic site of seizure origin (e.g., frontal lobe seizure), (4) tendency to spread to other structures in the brain, and (5) temporal patterns (e.g., nocturnal epilepsy). (From Adams et al., Principles of Neurology, 6th ed, p313),CSP: brain disorder characterized by recurring excessive neuronal discharge, exhibited by transient episodes of motor, sensory, or psychic dysfunction, with or without unconsciousness or convulsive movements.,NCI: A group of disorders marked by problems in the normal functioning of the brain. These problems can produce seizures, unusual body movements, a loss of consciousness or changes in consciousness, as well as mental problems or problems with the senses.,MEDLINEPLUS:
in scheme: umls
broader: http://linkedlifedata.com/resource/umls/id/C0006111
broader: http://linkedlifedata.com/resource/umls/id/C0007682
broader: http://linkedlifedata.com/resource/umls/id/C0027765
narrower: http://linkedlifedata.com/resource/umls/id/C0796046
narrower: http://linkedlifedata.com/resource/umls/id/C0796202
narrower: http://linkedlifedata.com/resource/umls/id/C0265339
narrower: http://linkedlifedata.com/resource/umls/id/C2931579
narrower: http://linkedlifedata.com/resource/umls/id/C2931496
narrower: http://linkedlifedata.com/resource/umls/id/C2931451
narrower: http://linkedlifedata.com/resource/umls/id/C0234533
narrower: http://linkedlifedata.com/resource/umls/id/C1849508
narrower: http://linkedlifedata.com/resource/umls/id/C0406740
narrower: http://linkedlifedata.com/resource/umls/id/C0795900
narrower: http://linkedlifedata.com/resource/umls/id/C0796133
narrower: http://linkedlifedata.com/resource/umls/id/C0265328
narrower: http://linkedlifedata.com/resource/umls/id/C1863090
narrower: http://linkedlifedata.com/resource/umls/id/C0086237
narrower: http://linkedlifedata.com/resource/umls/id/C0751110
narrower: http://linkedlifedata.com/resource/umls/id/C0751111
narrower: http://linkedlifedata.com/resource/umls/id/C0796010
narrower: http://linkedlifedata.com/resource/umls/id/C1856930
narrower: http://linkedlifedata.com/resource/umls/id/C1856929
narrower: http://linkedlifedata.com/resource/umls/id/C0270709
narrower: http://linkedlifedata.com/resource/umls/id/C1838491
narrower: http://linkedlifedata.com/resource/umls/id/C2931495
narrower: http://linkedlifedata.com/resource/umls/id/C2931668
narrower: http://linkedlifedata.com/resource/umls/id/C1866854
relation: R28421622
relation: R44102065
relation: R111875315
relation: R111875294
relation: R111875293
relation: R111875314
relation: R111875297
relation: R111875299
relation: R111875300
relation: R134155915
relation: R134155911
relation: R134155913
relation: R111875306
relation: R111875307
relation: R111875308
relation: R111875309
relation: R134155917
relation: R134155919
relation: R111875312
relation: R111875313
relation: R134155905
relation: R111875295
relation: R134155907
relation: R111875298
relation: R134155909
relation: R05302091
relation: R01045592
relation: R01046837
relation: R01046834
relation: R01046845
relation: R01046839
relation: R01046835
relation: R01046842
relation: R01046843
relation: R01046840
relation: R01046836
relation: R01046838