http://linkedlifedata.com/resource/umls/id/C0012854
type: T114
type: T123
type: Concept
has correlation: ANAT
has correlation: GENE
has correlation: PHYS
has correlation: PHEN
has correlation: PROC
has correlation: OBJC
has correlation: DEVI
has correlation: CONC
has correlation: CHEM
definition: CSP: deoxyribonucleotide polymer that is the primary genetic material of all cells; eukaryotic and prokaryotic organisms normally contain DNA in a double-stranded state, yet several important biological processes transiently involve single-stranded regions; DNA, which consists of a polysugar-phosphate backbone possessing projections of purines (adenine and guanine) and pyrimidines (thymine and cytosine), forms a double helix that is held together by hydrogen bonds between these purines and pyrimidines (adenine to thymine and guanine to cytosine).,MSH: A deoxyribonucleotide polymer that is the primary genetic material of all cells. Eukaryotic and prokaryotic organisms normally contain DNA in a double-stranded state, yet several important biological processes transiently involve single-stranded regions. DNA, which consists of a polysugar-phosphate backbone possessing projections of purines (adenine and guanine) and pyrimidines (thymine and cytosine), forms a double helix that is held together by hydrogen bonds
in scheme: umls
broader: http://linkedlifedata.com/resource/umls/id/C0028606
narrower: http://linkedlifedata.com/resource/umls/id/C0012939
narrower: http://linkedlifedata.com/resource/umls/id/C0012931
narrower: http://linkedlifedata.com/resource/umls/id/C0012929
narrower: http://linkedlifedata.com/resource/umls/id/C0012933
narrower: http://linkedlifedata.com/resource/umls/id/C0178630
narrower: http://linkedlifedata.com/resource/umls/id/C0006556
narrower: http://linkedlifedata.com/resource/umls/id/C0012924
narrower: http://linkedlifedata.com/resource/umls/id/C0012925
narrower: http://linkedlifedata.com/resource/umls/id/C0012927
narrower: http://linkedlifedata.com/resource/umls/id/C0043442
narrower: http://linkedlifedata.com/resource/umls/id/C0311474
narrower: http://linkedlifedata.com/resource/umls/id/C0077270
narrower: http://linkedlifedata.com/resource/umls/id/C0258032
narrower: http://linkedlifedata.com/resource/umls/id/C0658417
narrower: http://linkedlifedata.com/resource/umls/id/C0635832
narrower: http://linkedlifedata.com/resource/umls/id/C0126299
narrower: http://linkedlifedata.com/resource/umls/id/C0058608
narrower: http://linkedlifedata.com/resource/umls/id/C0966503
narrower: http://linkedlifedata.com/resource/umls/id/C0058604
narrower: http://linkedlifedata.com/resource/umls/id/C0069390
narrower: http://linkedlifedata.com/resource/umls/id/C0299133
narrower: http://linkedlifedata.com/resource/umls/id/C0606600
narrower: http://linkedlifedata.com/resource/umls/id/C0608601
narrower: http://linkedlifedata.com/resource/umls/id/C0621764
narrower: http://linkedlifedata.com/resource/umls/id/C0635489
narrower: http://linkedlifedata.com/resource/umls/id/C0965352
narrower: http://linkedlifedata.com/resource/umls/id/C1101657
narrower: http://linkedlifedata.com/resource/umls/id/C1179920
narrower: http://linkedlifedata.com/resource/umls/id/C1435422
narrower: http://linkedlifedata.com/resource/umls/id/C1530048
narrower: http://linkedlifedata.com/resource/umls/id/C1701891
narrower: http://linkedlifedata.com/resource/umls/id/C1701892
narrower: http://linkedlifedata.com/resource/umls/id/C1957609
narrower: http://linkedlifedata.com/resource/umls/id/C1957724
narrower: http://linkedlifedata.com/resource/umls/id/C1957725
narrower: http://linkedlifedata.com/resource/umls/id/C1957886
narrower: http://linkedlifedata.com/resource/umls/id/C1999933
narrower: http://linkedlifedata.com/resource/umls/id/C2001323
narrower: http://linkedlifedata.com/resource/umls/id/C2001324
narrower: http://linkedlifedata.com/resource/umls/id/C2351620
narrower: http://linkedlifedata.com/resource/umls/id/C2716499
narrower: http://linkedlifedata.com/resource/umls/id/C3492058
narrower: http://linkedlifedata.com/resource/umls/id/C3492329
relation: R05202764
relation: R05202766
relation: R05202765
relation: R05202767
relation: R05217075
relation: R00689831
relation: R00689832
relation: R00707648
relation: R00707650
relation: R00707649
relation: R00707652
relation: R00707651
relation: R00725434
relation: R00725431
relation: R00725432
relation: R00725433
relation: R00725435
relation: R00736681
relation: R05232036
relation: R05232037
relation: R05232035
relation: R18620887