http://linkedlifedata.com/resource/umls/id/C0011854
type: T047
type: Concept
has correlation: LIVB
has correlation: ANAT
has correlation: DISO
has correlation: GENE
has correlation: PHYS
has correlation: PHEN
has correlation: ACTI
has correlation: PROC
has correlation: DEVI
has correlation: CONC
has correlation: OCCU
has correlation: CHEM
definition: CSP: subtype of diabetes mellitus that is characterized by insulin deficiency; it is manifested by the sudden onset of severe hyperglycemia, rapid progression to diabetic ketoacidosis, and death unless treated with insulin; the disease may occur at any age, but is most common in childhood or adolescence.,NCI: Diabetes mellitus characterized by insulin deficiency, sudden onset, severe hyperglycemia, rapid progression to ketoacidosis, and death unless treated with insulin. The disease may occur at any age, but is most common in childhood or adolescence.,MEDLINEPLUS: Diabetes means your blood glucose, or blood sugar, is too high. With Type 1 diabetes, your pancreas does not make insulin. Insulin is a hormone that helps glucose get into your cells to give them energy. Without insulin, too much glucose stays in your blood. Over time, high blood glucose can lead to serious proble
in scheme: umls
broader: http://linkedlifedata.com/resource/umls/id/C0011849
broader: http://linkedlifedata.com/resource/umls/id/C0004364
narrower: http://linkedlifedata.com/resource/umls/id/C0432217
relation: R28414590
relation: R28492898
relation: R03688904
relation: R28419095
relation: R28492900
relation: R28492901
relation: R28419096
relation: R28492902
relation: R28492903
relation: R44026326
relation: R28427359
relation: R28428068
relation: R28428155
relation: R28452128
relation: R00746991
relation: R00746992
relation: R00746993
relation: R05672962
relation: R05672963
relation: R00893941
relation: R00893942
relation: R44024608
relation: R43987318
relation: R43987319
relation: R43987320
relation: R43987321
relation: R44024609
relation: R48839318
relation: R43987317
relation: R05720598
relation: R05720600
relation: R05720616
relation: R05720613
relation: R05720602
relation: R05720601
relation: R05720603
relation: R05720604
relation: R05720607
relation: R05720606
relation: R05720609
relation: R44006929
relation: R05720610
relation: R05720617
relation: R05720611
relation: R05720612
relation: R05720614
relation: R05720597
relation: R05720608
relation: R05720623
relation: R05720618
relation: R05720620
relation: R05720615
relation: R05720621
relation: R05720624
relation: R05720619
relation: R05720622
relation: R05720599
relation: R28459039
relation: R28535132
relation: R28535133
relation: R28535134