http://linkedlifedata.com/resource/umls/id/C0009968
type: T121
type: T123
type: T196
type: Concept
has correlation: ANAT
has correlation: DISO
has correlation: PHYS
has correlation: PHEN
has correlation: PROC
has correlation: OBJC
has correlation: DEVI
has correlation: CONC
has correlation: CHEM
definition: MSH: A heavy metal trace element with the atomic symbol Cu, atomic number 29, and atomic weight 63.55.,CSP: reddish, malleable metal; atomic number, 29; atomic weight, 63.54; symbol Cu; with poisonous salts; copper is essential in nutrition, being a component of various proteins, including ceruloplasmin, erythrocuprein, cytochrome c oxidase, and tyrosinase; deficiency, which is rare, may result in hypochromic microcytic anemia, neutropenia, and bone changes; excessive accumulation in the body may lead to copper poisoning.,NCI: An element with atomic symbol Cu, atomic number 29, and atomic weight 63.
in scheme: umls
broader: http://linkedlifedata.com/resource/umls/id/C0040577
broader: http://linkedlifedata.com/resource/umls/id/C0347988
broader: http://linkedlifedata.com/resource/umls/id/C0682907
narrower: http://linkedlifedata.com/resource/umls/id/C0056593
narrower: http://linkedlifedata.com/resource/umls/id/C0056598
narrower: http://linkedlifedata.com/resource/umls/id/C0074800
narrower: http://linkedlifedata.com/resource/umls/id/C0072819
narrower: http://linkedlifedata.com/resource/umls/id/C0083871
narrower: http://linkedlifedata.com/resource/umls/id/C0144499
narrower: http://linkedlifedata.com/resource/umls/id/C0056601
narrower: http://linkedlifedata.com/resource/umls/id/C0252725
narrower: http://linkedlifedata.com/resource/umls/id/C0589329
narrower: http://linkedlifedata.com/resource/umls/id/C0605539
narrower: http://linkedlifedata.com/resource/umls/id/C0674340
relation: R112875219
relation: R120248128
relation: R120248129
relation: R120248132
relation: R120248133
relation: R120248134
relation: R120248136
relation: R120248137
relation: R120248138
relation: R120248140
relation: R120248141
relation: R120248142
relation: R120248144
relation: R120248145
relation: R120248146
relation: R120248147
relation: R120248148
relation: R120248149
relation: R120248150
relation: R120248151
relation: R120248152
relation: R120248153
relation: R120248154
relation: R120248139
relation: R120248130
relation: R120248143
relation: R120248135
relation: R71153848
relation: R71094736
relation: R44717188
relation: R128796929
relation: R128796917
relation: R128796935
relation: R128796938
relation: R128796918
relation: R128796927
relation: R128796916
relation: R128796928
relation: R128796924
relation: R128796926
relation: R128796933
relation: R128796915
relation: R128796939
relation: R128796919
relation: R128796922
relation: R128796930
relation: R128796931
relation: R128796932
relation: R128796950
relation: R128796951
relation: R128796952