http://linkedlifedata.com/resource/umls/id/C0007222
type: T047
type: Concept
has correlation: ANAT
has correlation: DISO
has correlation: GENE
has correlation: PHYS
has correlation: PHEN
has correlation: PROC
has correlation: DEVI
has correlation: CONC
has correlation: OCCU
has correlation: CHEM
definition: MSH: Pathological conditions involving the CARDIOVASCULAR SYSTEM including the HEART; the BLOOD VESSELS; or the PERICARDIUM.,CSP: condition in which there is a deviation from or interruption of the normal structure or function of the cardiovascular system, including the heart or blood vessels.,NCI: A non-neoplastic or neoplastic disorder affecting the heart or the vessels (arteries, veins and lymph vessels). Representative examples of non-neoplastic cardiovascular disorders are endocarditis and hypertension. Representative examples of neoplastic cardiovascular disorders are endocardial myxoma and angiosarcoma.
in scheme: umls
broader: http://linkedlifedata.com/resource/umls/id/C0012634
broader: http://linkedlifedata.com/resource/umls/id/C0679384
narrower: http://linkedlifedata.com/resource/umls/id/C0018799
narrower: http://linkedlifedata.com/resource/umls/id/C0018801
narrower: http://linkedlifedata.com/resource/umls/id/C0020538
narrower: http://linkedlifedata.com/resource/umls/id/C0042373
narrower: http://linkedlifedata.com/resource/umls/id/C0038644
narrower: http://linkedlifedata.com/resource/umls/id/C0002940
narrower: http://linkedlifedata.com/resource/umls/id/C0018802
narrower: http://linkedlifedata.com/resource/umls/id/C0018824
narrower: http://linkedlifedata.com/resource/umls/id/C0023212
narrower: http://linkedlifedata.com/resource/umls/id/C0034063
narrower: http://linkedlifedata.com/resource/umls/id/C0728936
narrower: http://linkedlifedata.com/resource/umls/id/C0151620
narrower: http://linkedlifedata.com/resource/umls/id/C0034072
narrower: http://linkedlifedata.com/resource/umls/id/C0235527
narrower: http://linkedlifedata.com/resource/umls/id/C0020544
narrower: http://linkedlifedata.com/resource/umls/id/C0020541
narrower: http://linkedlifedata.com/resource/umls/id/C0020542
narrower: http://linkedlifedata.com/resource/umls/id/C0003490
narrower: http://linkedlifedata.com/resource/umls/id/C0235222
narrower: http://linkedlifedata.com/resource/umls/id/C0243050
narrower: http://linkedlifedata.com/resource/umls/id/C0546817
narrower: http://linkedlifedata.com/resource/umls/id/C0221347
narrower: http://linkedlifedata.com/resource/umls/id/C0020540
narrower: http://linkedlifedata.com/resource/umls/id/C0042420
narrower: http://linkedlifedata.com/resource/umls/id/C0043049
narrower: http://linkedlifedata.com/resource/umls/id/C0596270
narrower: http://linkedlifedata.com/resource/umls/id/C0234437
narrower: http://linkedlifedata.com/resource/umls/id/C0270276
narrower: http://linkedlifedata.com/resource/umls/id/C0597323
narrower: http://linkedlifedata.com/resource/umls/id/C0235436
narrower: http://linkedlifedata.com/resource/umls/id/C0235440
narrower: http://linkedlifedata.com/resource/umls/id/C0741160
narrower: http://linkedlifedata.com/resource/umls/id/C0235525
narrower: http://linkedlifedata.com/resource/umls/id/C0235530
narrower: http://linkedlifedata.com/resource/umls/id/C0264716
relation: R28415210
relation: R28488956
relation: R28488957
relation: R28488958
relation: R64605245
relation: R120227391
relation: R120227392
relation: R120227393
relation: R120227394
relation: R120227396
relation: R120227398
relation: R120227399
relation: R120227400
relation: R120227401
relation: R120227402
relation: R120227412
relation: R120227403
relation: R120227404
relation: R120227405
relation: R120227406
relation: R120227408
relation: R120227409
relation: R120227410
relation: R120227411
relation: R120227415
relation: R120227416
relation: R120227418
relation: R120227419
relation: R120227420