http://linkedlifedata.com/resource/umls/id/C0007012
type: T123
type: T197
type: Concept
has correlation: ANAT
has correlation: DISO
has correlation: PHYS
has correlation: PHEN
has correlation: PROC
has correlation: CONC
has correlation: CHEM
definition: MSH: A colorless, odorless gas that can be formed by the body and is necessary for the respiration cycle of plants and animals.,CSP: colorless, odorless gas, CO2, resulting from oxidation of carbon, formed by the tissues; necessary for the respiration cycle of plants and animals.,NCI: A colorless, odorless, incombustible gas resulting from the oxidation of carbon.,NCI: A colorless, odorless gas. It is a waste product made by the body. Carbon dioxide travels in the blood from the body's tissues to the lungs. Breathing out clears carbon dioxide from the lungs.
in scheme: umls
broader: http://linkedlifedata.com/resource/umls/id/C0206758
narrower: http://linkedlifedata.com/resource/umls/id/C0054739
narrower: http://linkedlifedata.com/resource/umls/id/C0054692
narrower: http://linkedlifedata.com/resource/umls/id/C0617045
relation: R28412016
relation: R112184354
relation: R28488695
relation: R112184618
relation: R120225219
relation: R120225220
relation: R120225222
relation: R120225223
relation: R120225224
relation: R120225225
relation: R120225226
relation: R120225227
relation: R120225228
relation: R120225229
relation: R120225231
relation: R120225232
relation: R120225233
relation: R120225235
relation: R120225236
relation: R120225237
relation: R120225238
relation: R120225239
relation: R120225240
relation: R120225241
relation: R120225242
relation: R120225243
relation: R120225244
relation: R120225245
relation: R120225230
relation: R120225221
relation: R120225234
relation: R71069009
relation: R71036909
relation: R71196276
relation: R71380696
relation: R128787112
relation: R128787114
relation: R128787113
relation: R28385453
relation: R28385454
relation: R28385455
relation: R71135074
relation: R71398357
relation: R71049165
relation: R71370470
relation: R71324430
relation: R70985361
relation: R71149728
relation: R71315376
relation: R71149729
relation: R71328171
relation: R71383360
relation: R71204926
relation: R71040004
relation: R71273235
relation: R71204927
relation: R71107846
relation: R71217743
relation: R71040015
relation: R70985370
relation: R71273236
relation: R71162508
relation: R70998077
relation: R71107847