http://linkedlifedata.com/resource/umls/id/C0006826
type: T191
type: Concept
has correlation: LIVB
has correlation: ANAT
has correlation: DISO
has correlation: GENE
has correlation: PHYS
has correlation: PHEN
has correlation: ACTI
has correlation: PROC
has correlation: OBJC
has correlation: DEVI
has correlation: CONC
has correlation: OCCU
has correlation: ORGA
has correlation: CHEM
definition: NCI: A term for diseases in which abnormal cells divide without control and can invade nearby tissues. Malignant cells can also spread to other parts of the body through the blood and lymph systems. There are several main types of malignancy. Carcinoma is a malignancy that begins in the skin or in tissues that line or cover internal organs. Sarcoma is a malignancy that begins in bone, cartilage, fat, muscle, blood vessels, or other connective or supportive tissue. Leukemia is a malignancy that starts in blood-forming tissue such as the bone marrow, and causes large numbers of abnormal blood cells to be produced and enter the blood. Lymphoma and multiple myeloma are malignancies that begin in the cells of the immune system. Central nervous system cancers are malignancies that begin in the tissues of the brain and spinal cord.,MEDLINEPLUS: Cancer begins in your cells, which are the building blocks of your body. Normally, your body forms new cells as you need them, replacing old cells that die. Sometimes this
in scheme: umls
broader: http://linkedlifedata.com/resource/umls/id/C0027651
narrower: http://linkedlifedata.com/resource/umls/id/C0006142
narrower: http://linkedlifedata.com/resource/umls/id/C0007114
narrower: http://linkedlifedata.com/resource/umls/id/C0027656
narrower: http://linkedlifedata.com/resource/umls/id/C1368683
narrower: http://linkedlifedata.com/resource/umls/id/C0206714
narrower: http://linkedlifedata.com/resource/umls/id/C0814137
narrower: http://linkedlifedata.com/resource/umls/id/C0027663
narrower: http://linkedlifedata.com/resource/umls/id/C0027766
narrower: http://linkedlifedata.com/resource/umls/id/C0242596
narrower: http://linkedlifedata.com/resource/umls/id/C0497243
narrower: http://linkedlifedata.com/resource/umls/id/C0751075
narrower: http://linkedlifedata.com/resource/umls/id/C0814144
narrower: http://linkedlifedata.com/resource/umls/id/C0814142
narrower: http://linkedlifedata.com/resource/umls/id/C0036210
narrower: http://linkedlifedata.com/resource/umls/id/C0814136
narrower: http://linkedlifedata.com/resource/umls/id/C0814141
narrower: http://linkedlifedata.com/resource/umls/id/C0751571
narrower: http://linkedlifedata.com/resource/umls/id/C0027654
narrower: http://linkedlifedata.com/resource/umls/id/C0278704
narrower: http://linkedlifedata.com/resource/umls/id/C0178619
narrower: http://linkedlifedata.com/resource/umls/id/C0282313
narrower: http://linkedlifedata.com/resource/umls/id/C0920774
narrower: http://linkedlifedata.com/resource/umls/id/C0920776
narrower: http://linkedlifedata.com/resource/umls/id/C0596263
relation: R04611580
relation: R04611581
relation: R04611582
relation: R41125542
relation: R05300705
relation: R05302387
relation: R05302385
relation: R05302384
relation: R05302393
relation: R05302395
relation: R05302394
relation: R44102449
relation: R05302389
relation: R05302386
relation: R44102451
relation: R05302392
relation: R05302391
relation: R44102450
relation: R05302390
relation: R05302398
relation: R111921111
relation: R134129437
relation: R134129439
relation: R111921602
relation: R00942107
relation: R05773041
relation: R05778120
relation: R00944060
relation: R12430059
relation: R00952023
relation: R12559648
relation: R12559662
relation: R12559674
relation: R12559677
relation: R12559690
relation: R12559655
relation: R12559721