http://linkedlifedata.com/resource/umls/id/C0003320
type: T129
type: Concept
has correlation: ANAT
has correlation: DISO
has correlation: GENE
has correlation: PHYS
has correlation: PHEN
has correlation: PROC
has correlation: CONC
has correlation: OCCU
has correlation: ORGA
has correlation: CHEM
definition: MSH: Substances that are recognized by the immune system and induce an immune reaction.,CSP: any substance recognized by the immune system and inducing an immune reaction.,NCI: Any substance that causes the body to make a specific immune response.,NCI: Any substance, generally a protein, that stimulates the immune system and elicits an immune response. Recognition by the immune system elicits either a T-lymphocyte response, recognizing processed antigens, or a B-lymphocyte response, producing antibodies that bind to unprocessed antigens.
in scheme: umls
broader: http://linkedlifedata.com/resource/umls/id/C0021054
narrower: http://linkedlifedata.com/resource/umls/id/C0002092
narrower: http://linkedlifedata.com/resource/umls/id/C1333018
narrower: http://linkedlifedata.com/resource/umls/id/C0022145
narrower: http://linkedlifedata.com/resource/umls/id/C0003331
narrower: http://linkedlifedata.com/resource/umls/id/C0003333
narrower: http://linkedlifedata.com/resource/umls/id/C0003339
narrower: http://linkedlifedata.com/resource/umls/id/C0004359
narrower: http://linkedlifedata.com/resource/umls/id/C0018593
narrower: http://linkedlifedata.com/resource/umls/id/C0041361
narrower: http://linkedlifedata.com/resource/umls/id/C1433278
narrower: http://linkedlifedata.com/resource/umls/id/C0253876
narrower: http://linkedlifedata.com/resource/umls/id/C0060028
narrower: http://linkedlifedata.com/resource/umls/id/C0039115
narrower: http://linkedlifedata.com/resource/umls/id/C0312558
narrower: http://linkedlifedata.com/resource/umls/id/C1307464
narrower: http://linkedlifedata.com/resource/umls/id/C0060029
narrower: http://linkedlifedata.com/resource/umls/id/C1448491
narrower: http://linkedlifedata.com/resource/umls/id/C0655279
narrower: http://linkedlifedata.com/resource/umls/id/C1308645
narrower: http://linkedlifedata.com/resource/umls/id/C1435633
narrower: http://linkedlifedata.com/resource/umls/id/C1437152
narrower: http://linkedlifedata.com/resource/umls/id/C1309405
narrower: http://linkedlifedata.com/resource/umls/id/C1291775
narrower: http://linkedlifedata.com/resource/umls/id/C0051532
narrower: http://linkedlifedata.com/resource/umls/id/C0060361
narrower: http://linkedlifedata.com/resource/umls/id/C0073050
narrower: http://linkedlifedata.com/resource/umls/id/C2934744
narrower: http://linkedlifedata.com/resource/umls/id/C0060290
narrower: http://linkedlifedata.com/resource/umls/id/C0071431
narrower: http://linkedlifedata.com/resource/umls/id/C0072560
narrower: http://linkedlifedata.com/resource/umls/id/C0074333
narrower: http://linkedlifedata.com/resource/umls/id/C0258658
narrower: http://linkedlifedata.com/resource/umls/id/C0377942
narrower: http://linkedlifedata.com/resource/umls/id/C0385794
narrower: http://linkedlifedata.com/resource/umls/id/C0385795
narrower: http://linkedlifedata.com/resource/umls/id/C0538136
narrower: http://linkedlifedata.com/resource/umls/id/C0604085
narrower: http://linkedlifedata.com/resource/umls/id/C0611399
narrower: http://linkedlifedata.com/resource/umls/id/C0616624
narrower: http://linkedlifedata.com/resource/umls/id/C0618736
narrower: http://linkedlifedata.com/resource/umls/id/C0621916
narrower: http://linkedlifedata.com/resource/umls/id/C0629783
narrower: http://linkedlifedata.com/resource/umls/id/C0633549
narrower: http://linkedlifedata.com/resource/umls/id/C0669493
narrower: http://linkedlifedata.com/resource/umls/id/C0764888
narrower: http://linkedlifedata.com/resource/umls/id/C0911683
narrower: http://linkedlifedata.com/resource/umls/id/C0911684
narrower: http://linkedlifedata.com/resource/umls/id/C0964618
narrower: http://linkedlifedata.com/resource/umls/id/C1308138
narrower: http://linkedlifedata.com/resource/umls/id/C1309031
narrower: http://linkedlifedata.com/resource/umls/id/C1313662
narrower: http://linkedlifedata.com/resource/umls/id/C1448089
relation: R120197315
relation: R120197316
relation: R120197318
relation: R120197319
relation: R120197320
relation: R120197321
relation: R120197322
relation: R120197324
relation: R120197325
relation: R120197326
relation: R120197328
relation: R120197329
relation: R120197331