http://linkedlifedata.com/resource/umls/id/C0001962
type: T109
type: Concept
has correlation: ANAT
has correlation: DISO
has correlation: PHYS
has correlation: PHEN
has correlation: PROC
has correlation: OBJC
has correlation: DEVI
has correlation: CONC
has correlation: CHEM
definition: MSH: A clear, colorless liquid rapidly absorbed from the gastrointestinal tract and distributed throughout the body. It has bactericidal activity and is used often as a topical disinfectant. It is widely used as a solvent and preservative in pharmaceutical preparations as well as serving as the primary ingredient in ALCOHOLIC BEVERAGES.,CSP: two carbon primary alcohol formed by microbial fermentation of carbohydrates or by synthesis from ethylene; it is a clear, colorless liquid rapidly absorbed from the gastrointestinal tract and distributed throughout the body; it has bactericidal activity and is used often as a topical disinfectant; it is widely used as a solvent and preservative in pharmaceutical preparations as well as serving as the active ingredient in alcoholic beverages.,PDQ: A colorless organic liquid also known as ethyl alcohol or grain alcohol. Ethanol's primary physiologic effects involve the central nervous system. Depending on the dose delivered, ethanol behaves as an anxiolytic, a depressant,
in scheme: umls
broader: http://linkedlifedata.com/resource/umls/id/C0001975
broader: http://linkedlifedata.com/resource/umls/id/C0815031
narrower: http://linkedlifedata.com/resource/umls/id/C0014967
narrower: http://linkedlifedata.com/resource/umls/id/C0015078
narrower: http://linkedlifedata.com/resource/umls/id/C0025402
narrower: http://linkedlifedata.com/resource/umls/id/C0031398
narrower: http://linkedlifedata.com/resource/umls/id/C0040983
narrower: http://linkedlifedata.com/resource/umls/id/C0085733
narrower: http://linkedlifedata.com/resource/umls/id/C0084847
narrower: http://linkedlifedata.com/resource/umls/id/C0719741
narrower: http://linkedlifedata.com/resource/umls/id/C0054815
narrower: http://linkedlifedata.com/resource/umls/id/C0654349
narrower: http://linkedlifedata.com/resource/umls/id/C0768895
narrower: http://linkedlifedata.com/resource/umls/id/C0046118
narrower: http://linkedlifedata.com/resource/umls/id/C0046204
narrower: http://linkedlifedata.com/resource/umls/id/C0054139
narrower: http://linkedlifedata.com/resource/umls/id/C0059799
narrower: http://linkedlifedata.com/resource/umls/id/C0063056
narrower: http://linkedlifedata.com/resource/umls/id/C0064150
narrower: http://linkedlifedata.com/resource/umls/id/C0080484
narrower: http://linkedlifedata.com/resource/umls/id/C0171641
narrower: http://linkedlifedata.com/resource/umls/id/C0174537
narrower: http://linkedlifedata.com/resource/umls/id/C0211624
narrower: http://linkedlifedata.com/resource/umls/id/C0292823
narrower: http://linkedlifedata.com/resource/umls/id/C0298975
narrower: http://linkedlifedata.com/resource/umls/id/C0378509
narrower: http://linkedlifedata.com/resource/umls/id/C0386726
narrower: http://linkedlifedata.com/resource/umls/id/C0533403
narrower: http://linkedlifedata.com/resource/umls/id/C0601929
narrower: http://linkedlifedata.com/resource/umls/id/C0625208
narrower: http://linkedlifedata.com/resource/umls/id/C0637317
narrower: http://linkedlifedata.com/resource/umls/id/C0671500
narrower: http://linkedlifedata.com/resource/umls/id/C0718321
narrower: http://linkedlifedata.com/resource/umls/id/C0721311
narrower: http://linkedlifedata.com/resource/umls/id/C0908735
narrower: http://linkedlifedata.com/resource/umls/id/C0909013
narrower: http://linkedlifedata.com/resource/umls/id/C0909015
narrower: http://linkedlifedata.com/resource/umls/id/C0909142
narrower: http://linkedlifedata.com/resource/umls/id/C0911719
narrower: http://linkedlifedata.com/resource/umls/id/C0911819
narrower: http://linkedlifedata.com/resource/umls/id/C1098166
narrower: http://linkedlifedata.com/resource/umls/id/C1120278
narrower: http://linkedlifedata.com/resource/umls/id/C1122067
narrower: http://linkedlifedata.com/resource/umls/id/C1138219
narrower: http://linkedlifedata.com/resource/umls/id/C1330040
narrower: http://linkedlifedata.com/resource/umls/id/C1608665
narrower: http://linkedlifedata.com/resource/umls/id/C1609369
narrower: http://linkedlifedata.com/resource/umls/id/C1722591
narrower: http://linkedlifedata.com/resource/umls/id/C1743742
narrower: http://linkedlifedata.com/resource/umls/id/C1870943
narrower: http://linkedlifedata.com/resource/umls/id/C1870962
narrower: http://linkedlifedata.com/resource/umls/id/C1957362
narrower: http://linkedlifedata.com/resource/umls/id/C1958449
narrower: http://linkedlifedata.com/resource/umls/id/C2002752
narrower: http://linkedlifedata.com/resource/umls/id/C2604319
narrower: http://linkedlifedata.com/resource/umls/id/C2714408
narrower: http://linkedlifedata.com/resource/umls/id/C2933389
narrower: http://linkedlifedata.com/resource/umls/id/C1170074
narrower: http://linkedlifedata.com/resource/umls/id/C2001961
narrower: http://linkedlifedata.com/resource/umls/id/C2973936
narrower: http://linkedlifedata.com/resource/umls/id/C3160342
narrower: http://linkedlifedata.com/resource/umls/id/C3180364
relation: R55153943
relation: R28484166
relation: R112184254
relation: R112185284
relation: R32097384