http://linkedlifedata.com/resource/umls/id/C0001480
type: T114
type: T121
type: T123
type: Concept
has correlation: ANAT
has correlation: DISO
has correlation: PHYS
has correlation: PHEN
has correlation: PROC
has correlation: CONC
has correlation: CHEM
definition: MSH: An adenine nucleotide containing three phosphate groups esterified to the sugar moiety. In addition to its crucial roles in metabolism adenosine triphosphate is a neurotransmitter.,CSP: adenine nucleotide containing three phosphate groups esterified to the sugar moiety; in addition to its crucial roles in metabolism adenosine triphosphate is a neurotransmitter.,NCI: A substance present in all living cells that provides energy for many metabolic processes and is involved in making RNA. Adenosine triphosphate made in the laboratory is being studied in patients with advanced solid tumors to see if it can decrease weight loss and improve muscle strength.,NCI: An adenine nucleotide comprised of three phosphate groups esterified to the sugar moiety, found in all living cells. Adenosine triphosphate is involved in energy production for metabolic processes and RNA synthesis. In addition, this substance acts as a neurotransmitter. In cancer studies, adenosine triphosphate is synthesized to examine its use to decr
in scheme: umls
broader: http://linkedlifedata.com/resource/umls/id/C0028630
broader: http://linkedlifedata.com/resource/umls/id/C0001413
broader: http://linkedlifedata.com/resource/umls/id/C0597106
narrower: http://linkedlifedata.com/resource/umls/id/C0617352
narrower: http://linkedlifedata.com/resource/umls/id/C2827108
narrower: http://linkedlifedata.com/resource/umls/id/C0052606
narrower: http://linkedlifedata.com/resource/umls/id/C0050784
narrower: http://linkedlifedata.com/resource/umls/id/C0630632
narrower: http://linkedlifedata.com/resource/umls/id/C0612927
narrower: http://linkedlifedata.com/resource/umls/id/C1870399
narrower: http://linkedlifedata.com/resource/umls/id/C1870400
narrower: http://linkedlifedata.com/resource/umls/id/C1870401
narrower: http://linkedlifedata.com/resource/umls/id/C0004221
narrower: http://linkedlifedata.com/resource/umls/id/C0006618
narrower: http://linkedlifedata.com/resource/umls/id/C0024471
narrower: http://linkedlifedata.com/resource/umls/id/C0045105
narrower: http://linkedlifedata.com/resource/umls/id/C0045127
narrower: http://linkedlifedata.com/resource/umls/id/C0045132
narrower: http://linkedlifedata.com/resource/umls/id/C0045920
narrower: http://linkedlifedata.com/resource/umls/id/C0046004
narrower: http://linkedlifedata.com/resource/umls/id/C0046109
narrower: http://linkedlifedata.com/resource/umls/id/C0046394
narrower: http://linkedlifedata.com/resource/umls/id/C0046838
narrower: http://linkedlifedata.com/resource/umls/id/C0046839
narrower: http://linkedlifedata.com/resource/umls/id/C0046840
narrower: http://linkedlifedata.com/resource/umls/id/C0046841
narrower: http://linkedlifedata.com/resource/umls/id/C0046845
narrower: http://linkedlifedata.com/resource/umls/id/C0046846
narrower: http://linkedlifedata.com/resource/umls/id/C0046849
narrower: http://linkedlifedata.com/resource/umls/id/C0046904
narrower: http://linkedlifedata.com/resource/umls/id/C0048541
narrower: http://linkedlifedata.com/resource/umls/id/C0048792
narrower: http://linkedlifedata.com/resource/umls/id/C0049016
narrower: http://linkedlifedata.com/resource/umls/id/C0049445
narrower: http://linkedlifedata.com/resource/umls/id/C0049451
narrower: http://linkedlifedata.com/resource/umls/id/C0049999
narrower: http://linkedlifedata.com/resource/umls/id/C0050037
narrower: http://linkedlifedata.com/resource/umls/id/C0050042
narrower: http://linkedlifedata.com/resource/umls/id/C0050056
narrower: http://linkedlifedata.com/resource/umls/id/C0050086
narrower: http://linkedlifedata.com/resource/umls/id/C0050742
narrower: http://linkedlifedata.com/resource/umls/id/C0050759
narrower: http://linkedlifedata.com/resource/umls/id/C0050760
narrower: http://linkedlifedata.com/resource/umls/id/C0050785
narrower: http://linkedlifedata.com/resource/umls/id/C0050812
narrower: http://linkedlifedata.com/resource/umls/id/C0050828
narrower: http://linkedlifedata.com/resource/umls/id/C0051285
narrower: http://linkedlifedata.com/resource/umls/id/C0052597
narrower: http://linkedlifedata.com/resource/umls/id/C0052607
narrower: http://linkedlifedata.com/resource/umls/id/C0055624
narrower: http://linkedlifedata.com/resource/umls/id/C0056008
narrower: http://linkedlifedata.com/resource/umls/id/C0056288
narrower: http://linkedlifedata.com/resource/umls/id/C0067206
narrower: http://linkedlifedata.com/resource/umls/id/C0067614
narrower: http://linkedlifedata.com/resource/umls/id/C0068429
narrower: http://linkedlifedata.com/resource/umls/id/C0069895
narrower: http://linkedlifedata.com/resource/umls/id/C0069896
narrower: http://linkedlifedata.com/resource/umls/id/C0070867
narrower: http://linkedlifedata.com/resource/umls/id/C0076217
narrower: http://linkedlifedata.com/resource/umls/id/C0080857
narrower: http://linkedlifedata.com/resource/umls/id/C0100088
narrower: http://linkedlifedata.com/resource/umls/id/C0109657
narrower: http://linkedlifedata.com/resource/umls/id/C0126945
narrower: http://linkedlifedata.com/resource/umls/id/C0133830
narrower: http://linkedlifedata.com/resource/umls/id/C0136127
narrower: http://linkedlifedata.com/resource/umls/id/C0169259
narrower: http://linkedlifedata.com/resource/umls/id/C0207131